{"text_format":"1","workbook":"xlsx","n_sheets":4,"sheets":["Tex-106-E or Tex-406-A","RX","Three Point Method Graph","Calculations"],"not_rendered":{"charts":2,"images":1,"macros":1,"external_links":0,"defined_names":162,"comments":1,"pivot_tables":0},"unopened":[{"sheet":"Three Point Method Graph","index":2,"reason":"not_a_worksheet"}],"bounds":{"document_bytes":16777216,"sheet_cells":100000,"rows_first":2000,"rows_last":500,"rows_between":2000,"halvings":0,"cell_chars":16384,"cell_head_chars":4096},"cells_cut":0,"cells_raw":0,"read":"whole","date_system":"1900"}

{"sheet":"Tex-106-E or Tex-406-A","index":0,"n_rows":104,"n_cols":11,"rows_kept":104,"cut":false,"hidden":false,"merged":[[104,1,104,3],[92,2,92,4],[94,2,94,4],[96,2,96,4],[57,3,58,3],[75,1,75,8],[67,1,67,8],[88,1,88,8],[87,1,87,8],[85,1,86,8],[89,2,89,4],[68,6,69,6],[68,7,69,7],[81,6,82,6],[100,6,100,8],[98,2,98,4],[100,1,100,3],[81,4,82,4],[57,8,58,8],[0,0,0,1],[21,5,21,7],[21,3,21,4],[29,3,29,5],[15,3,15,8],[13,7,13,8],[16,3,16,4],[8,7,8,8],[16,7,16,8],[11,3,11,4],[7,3,7,4],[7,7,7,8],[8,3,8,4],[10,7,10,8],[90,2,90,4],[68,5,69,5],[37,1,37,6],[68,2,69,2],[68,3,69,3],[68,4,69,4],[57,5,58,5],[57,6,58,6],[57,2,58,2],[76,2,76,5],[49,4,49,5],[39,5,39,6],[51,4,51,5],[80,3,80,6],[81,5,82,5],[81,3,82,3],[10,3,10,4],[9,7,9,8],[9,3,9,4],[23,3,23,6],[33,1,33,7],[12,3,12,4],[13,3,13,4],[14,3,14,8],[11,7,11,8],[12,7,12,8],[57,4,58,4],[24,4,24,5],[45,4,45,6],[38,5,38,6],[41,2,41,7],[43,4,43,5],[26,3,26,6],[31,4,31,5],[28,3,28,5],[57,7,58,7],[35,1,35,6],[36,1,36,6],[56,1,56,8],[54,1,54,8]]}
["TxDOT Manuals >",null,null,"Tex-104-E","Tex-105-E","Tex-106-E","Tex-107-E","Tex-406-A"]
[null,"TEXAS DEPARTMENT OF TRANSPORTATION",null,null,null,null,null,null,null,null,73]
[null,null,null,null,null,null,null,null,null,null,5]
[null,null,null,null,null,null,null,null,null,null,"TxRap1.xlsm::42072.436192"]
[null,"Tex-106-E or Tex-406-A"]
[]
[null,null,null,null,null,null,null,null,{"$f":"\"File Version: \" & TEXT(MID(sn,SEARCH(\"::\",sn,1)+2,20),\"mm/dd/yy hh:mm:ss\")","v":"File Version: 03/09/15 10:28:07"}]
[null,null,"SAMPLE ID:",null,null,null,"SAMPLED DATE:"]
[null,null,"TEST NUMBER:",null,null,null,"LETTING DATE:"]
[null,null,"SAMPLE STATUS:",null,null,null,"CONTROLLING CSJ:"]
[null,null,"COUNTY:",null,null,null,"SPEC YEAR:"]
[null,null,"SAMPLED BY:",null,null,null,"SPEC ITEM:"]
[null,null,"SAMPLE LOCATION:",null,null,null,"SPECIAL PROVISION:"]
[null,null,"MATERIAL CODE:",null,null,null,"GRADE:"]
[null,null,"MATERIAL NAME:"]
[null,null,"PRODUCER:"]
[null,null,"AREA ENGINEER:",null,null,null,"PROJECT MANAGER:"]
[]
[null,null,"COURSE\\LIFT:",null,"STATION:",null,null,"DIST. FROM CL:"]
[]
[]
[null,null,null,"Select Test Method:"]
[]
[null,null,null,"Decantation Test for Concrete Aggregates"]
[null,null,null,"by:"]
[]
[null,null,null,"Tex-406-A:Part I - Lab Method",null,null,null,"*Data must be removed for Part I."]
[]
[null,null,null,"Original Dry Mass of Sample (g)"]
[null,null,null,"Dry Mass After Washing (g)"]
[null,null,null,null,null,"% Loss :",{"$f":"IF(ISERROR((100*(G29-G30))/G29),\"\",(100*(G29-G30))/G29)","v":""}]
[null,null,null,null,"Loss <= 1.5% ",null,{"$f":"IF(G31=\"\",\"\",IF($G$31<=1.5,\"Yes\",\"*Fail\"))","v":""}]
[]
[null,"Tex-406-A:Part II - Field Method",null,null,null,null,null,null,"*Data must be removed for Part II."]
[]
[null,{"$f":"\"Mass of Pycnometer Containing Sample and Water To Fill Before Washing \"&IF(SpecYear=\"\",\"()\",IF(SpecYear=\"1995\",\"(kg)\",\"(lbs.)\"))&\":\"","v":"Mass of Pycnometer Containing Sample and Water To Fill Before Washing ():"}]
[null,{"$f":"\"Mass of Pycnometer Containing Sample and Water To Fill After Washing \"&IF(SpecYear=\"\",\"()\",IF(SpecYear=\"1995\",\"(kg)\",\"(lbs.)\"))&\":\"","v":"Mass of Pycnometer Containing Sample and Water To Fill After Washing ():"}]
[null,"Mass of Pycnometer Filled With Water at Approx. Same Temperature as above (g):"]
[null,null,null,null,null,"Percent Loss:",null,{"$f":"IF(ISERROR(100*((H36-H37)/(H36-H38))),\"\",100*((H36-H37)/(H36-H38)))","v":""}]
[null,null,null,null,null,"Loss <= 1.5% ",null,{"$f":"IF(H39=\"\",\"\",IF(H39<=1.5,\"Yes\",\"*Fail\"))","v":""}]
[]
[null,null,"Tex-406-A:Part III - Percent of Limestone in Decantation Material"]
[]
[null,null,null,null,"Normality of HCL Used",null,null,{"$f":"\"*Not Valid Data. Check percent loss for \" & DecantationMethod","v":"*Not Valid Data. Check percent loss for "}]
[]
[null,null,null,null,"Volume of HCL Used in Titration mL "]
[null,null,null,null,null,"Starting mL:"]
[null,null,null,null,null,"Ending mL:"]
[]
[null,null,null,null,"Sample Weight (g)"]
[]
[null,null,null,null,"Percent of Limestone:",null,{"$f":"IF(ISERROR(5*(G44*(G48-G47)/G50)),\"\",5*(G44*(G48-G47)/G50))","v":""}]
[]
[]
[null,"Determining Plasticity Index"]
[]
[null,"Liquid Limit - Tex-104-E"]
[null,null,"Dish No.","Mass of Wet Sample + Tare (g)","Mass of Dry Sample + Tare (g)","Tare Mass (g)","Moisture Content (%)","Number of Blows","Liquid Limit (%)"]
[]
[null,1,null,null,null,null,{"$f":"IF($F60=\"\",\"\",(($D60-$E60)/($E60-$F60))*100)","v":""},null,{"$f":"IF($H60=\"\",\"\",$G60*($H60/25)^0.121)","v":""}]
[null,2,null,null,null,null,"",null,""]
[null,3,null,null,null,null,"",null,""]
[null,4,null,null,null,null,"",null,""]
[null,5,null,null,null,null,"",null,""]
[null,6,null,null,null,null,"",null,""]
[null,null,null,null,null,null,null,"Liquid Limit",{"$f":"(IF(ISERROR(SUM(DataPoints)),\"\",IF(SUM(DataPoints)=0,\"\",IF(COUNT(I60:I65)<3,AVERAGE(I60:I61),bestfit))))","v":""}]
[]
[null,"Plastic Limit - Tex-105-E"]
[null,null,"Dish No.","Mass of Wet Sample + Tare (g)","Mass of Dry Sample + Tare (g)","Tare Mass (g)","Mass of Water (g)","Plastic Limit (%)"]
[]
[null,1,null,null,null,null,{"$f":"IF($F71=\"\",\"\",$D71-$E71)","v":""},{"$f":"IF($G71=\"\",\"\",100*($G71/($E71-$F71)))","v":""}]
[null,2,null,null,null,null,{"$f":"IF($F72=\"\",\"\",$D72-$E72)","v":""},{"$f":"IF($G72=\"\",\"\",100*($G72/($E72-$F72)))","v":""}]
[null,3,null,null,null,null,{"$f":"IF($F73=\"\",\"\",$D73-$E73)","v":""},{"$f":"IF($G73=\"\",\"\",100*($G73/($E73-$F73)))","v":""}]
[null,null,null,null,null,null,"Plastic Limit",{"$f":"IF(ISERROR(AVERAGE(H71:H73)),\"\",AVERAGE(H71:H73))","v":""}]
[]
[null,"Plasticity Index - Tex-106-E"]
[null,null,{"$f":"IF(OR(CheckBox4BLS=\"Yes\",$F$84<>\"\"),\"Plasticity Index Calculated from Linear Shrinkage:\",\"Plasticity Index:\")","v":"Plasticity Index:"},null,null,null,{"$f":"IF(ISERROR(IF(OR(CheckBox4BLS=\"Yes\",$F$84<>\"\"),LinearShrink*1.6,$I66-$H74)),\"\",IF(OR(CheckBox4BLS=\"Yes\",$F$84<>\"\"),LinearShrink*1.6,$I66-$H74))","v":""}]
[]
[null,null,null,null,null,"Calculate Plasticity Index from Bar Linear Shrinkage?"]
[]
[null,null,null,"Bar Linear Shrinkage - Tex-107-E"]
[null,null,null,"Unit",{"$f":"\"Initial Length (\" & Field61 & \")\"","v":"Initial Length ()"},{"$f":"\"Final Length (\" & Field61 & \")\"","v":"Final Length ()"},"Linear Shrinkage"]
[]
[null,null,null,null,{"$f":"IF(Unit=\"\",\"\",IF(Unit=\"percent\",100,IF(Unit=\"Inches\",5,127)))","v":""},null,{"$f":"IF(ISERROR(IF(D84=\"percent\",$E84-$F84,100*($E84-$F84)/$E84)),\"\",IF(D84=\"percent\",$E84-$F84,100*($E84-$F84)/$E84))","v":""}]
[null,"Remarks:",{"$f":"NOW()","v":"2015-06-23T14:58:31.150"}]
[]
[]
[]
[]
[null,"Test Method:","Tested By:",null,null,"Tested Date:"]
[null,"TX104"]
[]
[null,"TX105"]
[]
[null,"TX106"]
[]
[null,"TX107"]
[]
[null,"TX406"]
[null,"Test Stamp Code:",null,null,"Omit Test:","Completed Date:","Reviewed By:"]
[]
[null,"Locked By:","TxDOT:","District:","Area:"]
[]
[null,"Authorized By:",null,null,"Authorized Date:"]

{"sheet":"RX","index":1,"n_rows":98,"n_cols":9,"rows_kept":98,"cut":false,"hidden":true,"merged":[]}
[96]
["Fld_nbr","Value","Desc_1","Desc_2","Desc_3","Desc_4","Desc_5","Desc_6","Desc_7"]
[1,{"$f":"IF('Tex-106-E or Tex-406-A'!$B$86=\"\",\"\",'Tex-106-E or Tex-406-A'!$B$86)","v":""},{"$f":"'Tex-106-E or Tex-406-A'!$B$85","v":"Remarks:"}]
[2,{"$f":"IF('Tex-106-E or Tex-406-A'!$D$19=\"\",\"\",'Tex-106-E or Tex-406-A'!$D$19)","v":""},{"$f":"IF('Tex-106-E or Tex-406-A'!$C$19=\"\",\"\",'Tex-106-E or Tex-406-A'!$C$19)","v":"COURSE\\LIFT:"}]
[3,{"$f":"IF('Tex-106-E or Tex-406-A'!$C$91=\"\",\"\",'Tex-106-E or Tex-406-A'!$C$91)","v":""},"Tested By ",{"$f":"IF('Tex-106-E or Tex-406-A'!$B$91=\"\",\"\",'Tex-106-E or Tex-406-A'!$B$91)","v":"TX104"}]
[4,{"$f":"IF('Tex-106-E or Tex-406-A'!$F$91=\"\",\"\",'Tex-106-E or Tex-406-A'!$F$91)","v":""},"Tested Date ",{"$f":"IF('Tex-106-E or Tex-406-A'!$B$91=\"\",\"\",'Tex-106-E or Tex-406-A'!$B$91)","v":"TX104"}]
[5,{"$f":"IF('Tex-106-E or Tex-406-A'!$C$93=\"\",\"\",'Tex-106-E or Tex-406-A'!$C$93)","v":""},"Tested By ",{"$f":"IF('Tex-106-E or Tex-406-A'!$B$93=\"\",\"\",'Tex-106-E or Tex-406-A'!$B$93)","v":"TX105"}]
[6,{"$f":"IF('Tex-106-E or Tex-406-A'!$F$93=\"\",\"\",'Tex-106-E or Tex-406-A'!$F$93)","v":""},"Tested Date ",{"$f":"IF('Tex-106-E or Tex-406-A'!$B$93=\"\",\"\",'Tex-106-E or Tex-406-A'!$B$93)","v":"TX105"}]
[7,{"$f":"IF('Tex-106-E or Tex-406-A'!$C$95=\"\",\"\",'Tex-106-E or Tex-406-A'!$C$95)","v":""},"Tested By ",{"$f":"IF('Tex-106-E or Tex-406-A'!$B$95=\"\",\"\",'Tex-106-E or Tex-406-A'!$B$95)","v":"TX106"}]
[8,{"$f":"IF('Tex-106-E or Tex-406-A'!$F$95=\"\",\"\",'Tex-106-E or Tex-406-A'!$F$95)","v":""},"Tested Date ",{"$f":"IF('Tex-106-E or Tex-406-A'!$B$95=\"\",\"\",'Tex-106-E or Tex-406-A'!$B$95)","v":"TX106"}]
[9,{"$f":"IF('Tex-106-E or Tex-406-A'!$C$97=\"\",\"\",'Tex-106-E or Tex-406-A'!$C$97)","v":""},"Tested By ",{"$f":"IF('Tex-106-E or Tex-406-A'!$B$97=\"\",\"\",'Tex-106-E or Tex-406-A'!$B$97)","v":"TX107"}]
[10,{"$f":"IF('Tex-106-E or Tex-406-A'!$F$97=\"\",\"\",'Tex-106-E or Tex-406-A'!$F$97)","v":""},"Tested Date ",{"$f":"IF('Tex-106-E or Tex-406-A'!$B$97=\"\",\"\",'Tex-106-E or Tex-406-A'!$B$97)","v":"TX107"}]
[11,{"$f":"IF('Tex-106-E or Tex-406-A'!$C$99=\"\",\"\",'Tex-106-E or Tex-406-A'!$C$99)","v":""},"Tested By ",{"$f":"IF('Tex-106-E or Tex-406-A'!$B$99=\"\",\"\",'Tex-106-E or Tex-406-A'!$B$99)","v":"TX406"}]
[12,{"$f":"IF('Tex-106-E or Tex-406-A'!$F$99=\"\",\"\",'Tex-106-E or Tex-406-A'!$F$99)","v":""},"Tested Date ",{"$f":"IF('Tex-106-E or Tex-406-A'!$B$99=\"\",\"\",'Tex-106-E or Tex-406-A'!$B$99)","v":"TX406"}]
[13,{"$f":"IF('Tex-106-E or Tex-406-A'!$F$22=\"\",\"\",'Tex-106-E or Tex-406-A'!$F$22)","v":""},{"$f":"IF('Tex-106-E or Tex-406-A'!$B$5=\"\",\"\",'Tex-106-E or Tex-406-A'!$B$5)","v":"Tex-106-E or Tex-406-A"},{"$f":"IF('Tex-106-E or Tex-406-A'!$D$22=\"\",\"\",'Tex-106-E or Tex-406-A'!$D$22)","v":"Select Test Method:"}]
[14,{"$f":"IF('Tex-106-E or Tex-406-A'!$E$25=\"\",\"\",'Tex-106-E or Tex-406-A'!$E$25)","v":""},{"$f":"IF('Tex-106-E or Tex-406-A'!$F$22=\"\",\"\",'Tex-106-E or Tex-406-A'!$F$22)","v":""},{"$f":"IF('Tex-106-E or Tex-406-A'!$D$24=\"\",\"\",'Tex-106-E or Tex-406-A'!$D$24)","v":"Decantation Test for Concrete Aggregates"}]
[15,{"$f":"IF('Tex-106-E or Tex-406-A'!$G$29=\"\",\"\",'Tex-106-E or Tex-406-A'!$G$29)","v":""},{"$f":"IF('Tex-106-E or Tex-406-A'!$D$27=\"\",\"\",'Tex-106-E or Tex-406-A'!$D$27)","v":"Tex-406-A:Part I - Lab Method"},{"$f":"IF('Tex-106-E or Tex-406-A'!$D$29=\"\",\"\",'Tex-106-E or Tex-406-A'!$D$29)","v":"Original Dry Mass of Sample (g)"}]
[16,{"$f":"IF('Tex-106-E or Tex-406-A'!$G$30=\"\",\"\",'Tex-106-E or Tex-406-A'!$G$30)","v":""},{"$f":"IF('Tex-106-E or Tex-406-A'!$D$27=\"\",\"\",'Tex-106-E or Tex-406-A'!$D$27)","v":"Tex-406-A:Part I - Lab Method"},{"$f":"IF('Tex-106-E or Tex-406-A'!$D$30=\"\",\"\",'Tex-106-E or Tex-406-A'!$D$30)","v":"Dry Mass After Washing (g)"}]
[17,{"$f":"IF('Tex-106-E or Tex-406-A'!$G$31=\"\",\"\",'Tex-106-E or Tex-406-A'!$G$31)","v":""},{"$f":"IF('Tex-106-E or Tex-406-A'!$D$27=\"\",\"\",'Tex-106-E or Tex-406-A'!$D$27)","v":"Tex-406-A:Part I - Lab Method"},{"$f":"IF('Tex-106-E or Tex-406-A'!$F$31=\"\",\"\",'Tex-106-E or Tex-406-A'!$F$31)","v":"% Loss :"}]
[18,{"$f":"IF('Tex-106-E or Tex-406-A'!$G$32=\"\",\"\",'Tex-106-E or Tex-406-A'!$G$32)","v":""},{"$f":"IF('Tex-106-E or Tex-406-A'!$D$27=\"\",\"\",'Tex-106-E or Tex-406-A'!$D$27)","v":"Tex-406-A:Part I - Lab Method"},{"$f":"IF('Tex-106-E or Tex-406-A'!$E$32=\"\",\"\",'Tex-106-E or Tex-406-A'!$E$32)","v":"Loss <= 1.5% "}]
[19,{"$f":"IF('Tex-106-E or Tex-406-A'!$H$36=\"\",\"\",'Tex-106-E or Tex-406-A'!$H$36)","v":""},{"$f":"IF('Tex-106-E or Tex-406-A'!$B$34=\"\",\"\",'Tex-106-E or Tex-406-A'!$B$34)","v":"Tex-406-A:Part II - Field Method"},{"$f":"IF('Tex-106-E or Tex-406-A'!$B$36=\"\",\"\",'Tex-106-E or Tex-406-A'!$B$36)","v":"Mass of Pycnometer Containing Sample and Water To Fill Before Washing ():"}]
[20,{"$f":"IF('Tex-106-E or Tex-406-A'!$H$37=\"\",\"\",'Tex-106-E or Tex-406-A'!$H$37)","v":""},{"$f":"IF('Tex-106-E or Tex-406-A'!$B$34=\"\",\"\",'Tex-106-E or Tex-406-A'!$B$34)","v":"Tex-406-A:Part II - Field Method"},{"$f":"IF('Tex-106-E or Tex-406-A'!$B$37=\"\",\"\",'Tex-106-E or Tex-406-A'!$B$37)","v":"Mass of Pycnometer Containing Sample and Water To Fill After Washing ():"}]
[21,{"$f":"IF('Tex-106-E or Tex-406-A'!$H$38=\"\",\"\",'Tex-106-E or Tex-406-A'!$H$38)","v":""},{"$f":"IF('Tex-106-E or Tex-406-A'!$B$34=\"\",\"\",'Tex-106-E or Tex-406-A'!$B$34)","v":"Tex-406-A:Part II - Field Method"},{"$f":"IF('Tex-106-E or Tex-406-A'!$B$38=\"\",\"\",'Tex-106-E or Tex-406-A'!$B$38)","v":"Mass of Pycnometer Filled With Water at Approx. Same Temperature as above (g):"}]
[22,{"$f":"IF('Tex-106-E or Tex-406-A'!$H$39=\"\",\"\",'Tex-106-E or Tex-406-A'!$H$39)","v":""},{"$f":"IF('Tex-106-E or Tex-406-A'!$B$34=\"\",\"\",'Tex-106-E or Tex-406-A'!$B$34)","v":"Tex-406-A:Part II - Field Method"},{"$f":"IF('Tex-106-E or Tex-406-A'!$F$39=\"\",\"\",'Tex-106-E or Tex-406-A'!$F$39)","v":"Percent Loss:"}]
[23,{"$f":"IF('Tex-106-E or Tex-406-A'!$H$40=\"\",\"\",'Tex-106-E or Tex-406-A'!$H$40)","v":""},{"$f":"IF('Tex-106-E or Tex-406-A'!$B$34=\"\",\"\",'Tex-106-E or Tex-406-A'!$B$34)","v":"Tex-406-A:Part II - Field Method"},{"$f":"IF('Tex-106-E or Tex-406-A'!$F$40=\"\",\"\",'Tex-106-E or Tex-406-A'!$F$40)","v":"Loss <= 1.5% "}]
[24,{"$f":"IF('Tex-106-E or Tex-406-A'!$G$44=\"\",\"\",'Tex-106-E or Tex-406-A'!$G$44)","v":""},{"$f":"IF('Tex-106-E or Tex-406-A'!$C$42=\"\",\"\",'Tex-106-E or Tex-406-A'!$C$42)","v":"Tex-406-A:Part III - Percent of Limestone in Decantation Material"},{"$f":"IF('Tex-106-E or Tex-406-A'!$E$44=\"\",\"\",'Tex-106-E or Tex-406-A'!$E$44)","v":"Normality of HCL Used"}]
[25,{"$f":"IF('Tex-106-E or Tex-406-A'!$G$47=\"\",\"\",'Tex-106-E or Tex-406-A'!$G$47)","v":""},{"$f":"IF('Tex-106-E or Tex-406-A'!$C$42=\"\",\"\",'Tex-106-E or Tex-406-A'!$C$42)","v":"Tex-406-A:Part III - Percent of Limestone in Decantation Material"},{"$f":"IF('Tex-106-E or Tex-406-A'!$E$46=\"\",\"\",'Tex-106-E or Tex-406-A'!$E$46)","v":"Volume of HCL Used in Titration mL "},{"$f":"IF('Tex-106-E or Tex-406-A'!$F$47=\"\",\"\",'Tex-106-E or Tex-406-A'!$F$47)","v":"Starting mL:"}]
[26,{"$f":"IF('Tex-106-E or Tex-406-A'!$G$48=\"\",\"\",'Tex-106-E or Tex-406-A'!$G$48)","v":""},{"$f":"IF('Tex-106-E or Tex-406-A'!$C$42=\"\",\"\",'Tex-106-E or Tex-406-A'!$C$42)","v":"Tex-406-A:Part III - Percent of Limestone in Decantation Material"},{"$f":"IF('Tex-106-E or Tex-406-A'!$E$46=\"\",\"\",'Tex-106-E or Tex-406-A'!$E$46)","v":"Volume of HCL Used in Titration mL "},{"$f":"IF('Tex-106-E or Tex-406-A'!$F$48=\"\",\"\",'Tex-106-E or Tex-406-A'!$F$48)","v":"Ending mL:"}]
[27,{"$f":"IF('Tex-106-E or Tex-406-A'!$G$50=\"\",\"\",'Tex-106-E or Tex-406-A'!$G$50)","v":""},{"$f":"IF('Tex-106-E or Tex-406-A'!$C$42=\"\",\"\",'Tex-106-E or Tex-406-A'!$C$42)","v":"Tex-406-A:Part III - Percent of Limestone in Decantation Material"},{"$f":"IF('Tex-106-E or Tex-406-A'!$E$50=\"\",\"\",'Tex-106-E or Tex-406-A'!$E$50)","v":"Sample Weight (g)"}]
[28,{"$f":"IF('Tex-106-E or Tex-406-A'!$G$52=\"\",\"\",'Tex-106-E or Tex-406-A'!$G$52)","v":""},{"$f":"IF('Tex-106-E or Tex-406-A'!$C$42=\"\",\"\",'Tex-106-E or Tex-406-A'!$C$42)","v":"Tex-406-A:Part III - Percent of Limestone in Decantation Material"},{"$f":"IF('Tex-106-E or Tex-406-A'!$E$52=\"\",\"\",'Tex-106-E or Tex-406-A'!$E$52)","v":"Percent of Limestone:"}]
[29,{"$f":"IF('Tex-106-E or Tex-406-A'!$C$60=\"\",\"\",'Tex-106-E or Tex-406-A'!$C$60)","v":""},{"$f":"IF('Tex-106-E or Tex-406-A'!$B$57=\"\",\"\",'Tex-106-E or Tex-406-A'!$B$57)","v":"Liquid Limit - Tex-104-E"},{"$f":"IF('Tex-106-E or Tex-406-A'!$B$58=\"\",\"\",'Tex-106-E or Tex-406-A'!$B$58)","v":""},{"$f":"IF('Tex-106-E or Tex-406-A'!$B$60=\"\",\"\",'Tex-106-E or Tex-406-A'!$B$60)","v":1},{"$f":"IF('Tex-106-E or Tex-406-A'!$C$58=\"\",\"\",'Tex-106-E or Tex-406-A'!$C$58)","v":"Dish No."}]
[30,{"$f":"IF('Tex-106-E or Tex-406-A'!$D$60=\"\",\"\",'Tex-106-E or Tex-406-A'!$D$60)","v":""},{"$f":"IF('Tex-106-E or Tex-406-A'!$B$57=\"\",\"\",'Tex-106-E or Tex-406-A'!$B$57)","v":"Liquid Limit - Tex-104-E"},{"$f":"IF('Tex-106-E or Tex-406-A'!$B$58=\"\",\"\",'Tex-106-E or Tex-406-A'!$B$58)","v":""},{"$f":"IF('Tex-106-E or Tex-406-A'!$B$60=\"\",\"\",'Tex-106-E or Tex-406-A'!$B$60)","v":1},{"$f":"IF('Tex-106-E or Tex-406-A'!$D$58=\"\",\"\",'Tex-106-E or Tex-406-A'!$D$58)","v":"Mass of Wet Sample + Tare (g)"}]
[31,{"$f":"IF('Tex-106-E or Tex-406-A'!$E$60=\"\",\"\",'Tex-106-E or Tex-406-A'!$E$60)","v":""},{"$f":"IF('Tex-106-E or Tex-406-A'!$B$57=\"\",\"\",'Tex-106-E or Tex-406-A'!$B$57)","v":"Liquid Limit - Tex-104-E"},{"$f":"IF('Tex-106-E or Tex-406-A'!$B$58=\"\",\"\",'Tex-106-E or Tex-406-A'!$B$58)","v":""},{"$f":"IF('Tex-106-E or Tex-406-A'!$B$60=\"\",\"\",'Tex-106-E or Tex-406-A'!$B$60)","v":1},{"$f":"IF('Tex-106-E or Tex-406-A'!$E$58=\"\",\"\",'Tex-106-E or Tex-406-A'!$E$58)","v":"Mass of Dry Sample + Tare (g)"}]
[32,{"$f":"IF('Tex-106-E or Tex-406-A'!$F$60=\"\",\"\",'Tex-106-E or Tex-406-A'!$F$60)","v":""},{"$f":"IF('Tex-106-E or Tex-406-A'!$B$57=\"\",\"\",'Tex-106-E or Tex-406-A'!$B$57)","v":"Liquid Limit - Tex-104-E"},{"$f":"IF('Tex-106-E or Tex-406-A'!$B$58=\"\",\"\",'Tex-106-E or Tex-406-A'!$B$58)","v":""},{"$f":"IF('Tex-106-E or Tex-406-A'!$B$60=\"\",\"\",'Tex-106-E or Tex-406-A'!$B$60)","v":1},{"$f":"IF('Tex-106-E or Tex-406-A'!$F$58=\"\",\"\",'Tex-106-E or Tex-406-A'!$F$58)","v":"Tare Mass (g)"}]
[33,{"$f":"IF('Tex-106-E or Tex-406-A'!$G$60=\"\",\"\",'Tex-106-E or Tex-406-A'!$G$60)","v":""},{"$f":"IF('Tex-106-E or Tex-406-A'!$B$57=\"\",\"\",'Tex-106-E or Tex-406-A'!$B$57)","v":"Liquid Limit - Tex-104-E"},{"$f":"IF('Tex-106-E or Tex-406-A'!$B$58=\"\",\"\",'Tex-106-E or Tex-406-A'!$B$58)","v":""},{"$f":"IF('Tex-106-E or Tex-406-A'!$B$60=\"\",\"\",'Tex-106-E or Tex-406-A'!$B$60)","v":1},{"$f":"IF('Tex-106-E or Tex-406-A'!$G$58=\"\",\"\",'Tex-106-E or Tex-406-A'!$G$58)","v":"Moisture Content (%)"}]
[34,{"$f":"IF('Tex-106-E or Tex-406-A'!$H$60=\"\",\"\",'Tex-106-E or Tex-406-A'!$H$60)","v":""},{"$f":"IF('Tex-106-E or Tex-406-A'!$B$57=\"\",\"\",'Tex-106-E or Tex-406-A'!$B$57)","v":"Liquid Limit - Tex-104-E"},{"$f":"IF('Tex-106-E or Tex-406-A'!$B$58=\"\",\"\",'Tex-106-E or Tex-406-A'!$B$58)","v":""},{"$f":"IF('Tex-106-E or Tex-406-A'!$B$60=\"\",\"\",'Tex-106-E or Tex-406-A'!$B$60)","v":1},{"$f":"IF('Tex-106-E or Tex-406-A'!$H$58=\"\",\"\",'Tex-106-E or Tex-406-A'!$H$58)","v":"Number of Blows"}]
[35,{"$f":"IF('Tex-106-E or Tex-406-A'!$I$60=\"\",\"\",'Tex-106-E or Tex-406-A'!$I$60)","v":""},{"$f":"IF('Tex-106-E or Tex-406-A'!$B$57=\"\",\"\",'Tex-106-E or Tex-406-A'!$B$57)","v":"Liquid Limit - Tex-104-E"},{"$f":"IF('Tex-106-E or Tex-406-A'!$B$58=\"\",\"\",'Tex-106-E or Tex-406-A'!$B$58)","v":""},{"$f":"IF('Tex-106-E or Tex-406-A'!$B$60=\"\",\"\",'Tex-106-E or Tex-406-A'!$B$60)","v":1},{"$f":"IF('Tex-106-E or Tex-406-A'!$I$58=\"\",\"\",'Tex-106-E or Tex-406-A'!$I$58)","v":"Liquid Limit (%)"}]
[36,{"$f":"IF('Tex-106-E or Tex-406-A'!$C$61=\"\",\"\",'Tex-106-E or Tex-406-A'!$C$61)","v":""},{"$f":"IF('Tex-106-E or Tex-406-A'!$B$57=\"\",\"\",'Tex-106-E or Tex-406-A'!$B$57)","v":"Liquid Limit - Tex-104-E"},{"$f":"IF('Tex-106-E or Tex-406-A'!$B$58=\"\",\"\",'Tex-106-E or Tex-406-A'!$B$58)","v":""},{"$f":"IF('Tex-106-E or Tex-406-A'!$B$61=\"\",\"\",'Tex-106-E or Tex-406-A'!$B$61)","v":2},{"$f":"IF('Tex-106-E or Tex-406-A'!$C$58=\"\",\"\",'Tex-106-E or Tex-406-A'!$C$58)","v":"Dish No."}]
[37,{"$f":"IF('Tex-106-E or Tex-406-A'!$D$61=\"\",\"\",'Tex-106-E or Tex-406-A'!$D$61)","v":""},{"$f":"IF('Tex-106-E or Tex-406-A'!$B$57=\"\",\"\",'Tex-106-E or Tex-406-A'!$B$57)","v":"Liquid Limit - Tex-104-E"},{"$f":"IF('Tex-106-E or Tex-406-A'!$B$58=\"\",\"\",'Tex-106-E or Tex-406-A'!$B$58)","v":""},{"$f":"IF('Tex-106-E or Tex-406-A'!$B$61=\"\",\"\",'Tex-106-E or Tex-406-A'!$B$61)","v":2},{"$f":"IF('Tex-106-E or Tex-406-A'!$D$58=\"\",\"\",'Tex-106-E or Tex-406-A'!$D$58)","v":"Mass of Wet Sample + Tare (g)"}]
[38,{"$f":"IF('Tex-106-E or Tex-406-A'!$E$61=\"\",\"\",'Tex-106-E or Tex-406-A'!$E$61)","v":""},{"$f":"IF('Tex-106-E or Tex-406-A'!$B$57=\"\",\"\",'Tex-106-E or Tex-406-A'!$B$57)","v":"Liquid Limit - Tex-104-E"},{"$f":"IF('Tex-106-E or Tex-406-A'!$B$58=\"\",\"\",'Tex-106-E or Tex-406-A'!$B$58)","v":""},{"$f":"IF('Tex-106-E or Tex-406-A'!$B$61=\"\",\"\",'Tex-106-E or Tex-406-A'!$B$61)","v":2},{"$f":"IF('Tex-106-E or Tex-406-A'!$E$58=\"\",\"\",'Tex-106-E or Tex-406-A'!$E$58)","v":"Mass of Dry Sample + Tare (g)"}]
[39,{"$f":"IF('Tex-106-E or Tex-406-A'!$F$61=\"\",\"\",'Tex-106-E or Tex-406-A'!$F$61)","v":""},{"$f":"IF('Tex-106-E or Tex-406-A'!$B$57=\"\",\"\",'Tex-106-E or Tex-406-A'!$B$57)","v":"Liquid Limit - Tex-104-E"},{"$f":"IF('Tex-106-E or Tex-406-A'!$B$58=\"\",\"\",'Tex-106-E or Tex-406-A'!$B$58)","v":""},{"$f":"IF('Tex-106-E or Tex-406-A'!$B$61=\"\",\"\",'Tex-106-E or Tex-406-A'!$B$61)","v":2},{"$f":"IF('Tex-106-E or Tex-406-A'!$F$58=\"\",\"\",'Tex-106-E or Tex-406-A'!$F$58)","v":"Tare Mass (g)"}]
[40,{"$f":"IF('Tex-106-E or Tex-406-A'!$G$61=\"\",\"\",'Tex-106-E or Tex-406-A'!$G$61)","v":""},{"$f":"IF('Tex-106-E or Tex-406-A'!$B$57=\"\",\"\",'Tex-106-E or Tex-406-A'!$B$57)","v":"Liquid Limit - Tex-104-E"},{"$f":"IF('Tex-106-E or Tex-406-A'!$B$58=\"\",\"\",'Tex-106-E or Tex-406-A'!$B$58)","v":""},{"$f":"IF('Tex-106-E or Tex-406-A'!$B$61=\"\",\"\",'Tex-106-E or Tex-406-A'!$B$61)","v":2},{"$f":"IF('Tex-106-E or Tex-406-A'!$G$58=\"\",\"\",'Tex-106-E or Tex-406-A'!$G$58)","v":"Moisture Content (%)"}]
[41,{"$f":"IF('Tex-106-E or Tex-406-A'!$H$61=\"\",\"\",'Tex-106-E or Tex-406-A'!$H$61)","v":""},{"$f":"IF('Tex-106-E or Tex-406-A'!$B$57=\"\",\"\",'Tex-106-E or Tex-406-A'!$B$57)","v":"Liquid Limit - Tex-104-E"},{"$f":"IF('Tex-106-E or Tex-406-A'!$B$58=\"\",\"\",'Tex-106-E or Tex-406-A'!$B$58)","v":""},{"$f":"IF('Tex-106-E or Tex-406-A'!$B$61=\"\",\"\",'Tex-106-E or Tex-406-A'!$B$61)","v":2},{"$f":"IF('Tex-106-E or Tex-406-A'!$H$58=\"\",\"\",'Tex-106-E or Tex-406-A'!$H$58)","v":"Number of Blows"}]
[42,{"$f":"IF('Tex-106-E or Tex-406-A'!$I$61=\"\",\"\",'Tex-106-E or Tex-406-A'!$I$61)","v":""},{"$f":"IF('Tex-106-E or Tex-406-A'!$B$57=\"\",\"\",'Tex-106-E or Tex-406-A'!$B$57)","v":"Liquid Limit - Tex-104-E"},{"$f":"IF('Tex-106-E or Tex-406-A'!$B$58=\"\",\"\",'Tex-106-E or Tex-406-A'!$B$58)","v":""},{"$f":"IF('Tex-106-E or Tex-406-A'!$B$61=\"\",\"\",'Tex-106-E or Tex-406-A'!$B$61)","v":2},{"$f":"IF('Tex-106-E or Tex-406-A'!$I$58=\"\",\"\",'Tex-106-E or Tex-406-A'!$I$58)","v":"Liquid Limit (%)"}]
[43,{"$f":"IF('Tex-106-E or Tex-406-A'!$C$62=\"\",\"\",'Tex-106-E or Tex-406-A'!$C$62)","v":""},{"$f":"IF('Tex-106-E or Tex-406-A'!$B$57=\"\",\"\",'Tex-106-E or Tex-406-A'!$B$57)","v":"Liquid Limit - Tex-104-E"},{"$f":"IF('Tex-106-E or Tex-406-A'!$B$58=\"\",\"\",'Tex-106-E or Tex-406-A'!$B$58)","v":""},{"$f":"IF('Tex-106-E or Tex-406-A'!$B$62=\"\",\"\",'Tex-106-E or Tex-406-A'!$B$62)","v":3},{"$f":"IF('Tex-106-E or Tex-406-A'!$C$58=\"\",\"\",'Tex-106-E or Tex-406-A'!$C$58)","v":"Dish No."}]
[44,{"$f":"IF('Tex-106-E or Tex-406-A'!$D$62=\"\",\"\",'Tex-106-E or Tex-406-A'!$D$62)","v":""},{"$f":"IF('Tex-106-E or Tex-406-A'!$B$57=\"\",\"\",'Tex-106-E or Tex-406-A'!$B$57)","v":"Liquid Limit - Tex-104-E"},{"$f":"IF('Tex-106-E or Tex-406-A'!$B$58=\"\",\"\",'Tex-106-E or Tex-406-A'!$B$58)","v":""},{"$f":"IF('Tex-106-E or Tex-406-A'!$B$62=\"\",\"\",'Tex-106-E or Tex-406-A'!$B$62)","v":3},{"$f":"IF('Tex-106-E or Tex-406-A'!$D$58=\"\",\"\",'Tex-106-E or Tex-406-A'!$D$58)","v":"Mass of Wet Sample + Tare (g)"}]
[45,{"$f":"IF('Tex-106-E or Tex-406-A'!$E$62=\"\",\"\",'Tex-106-E or Tex-406-A'!$E$62)","v":""},{"$f":"IF('Tex-106-E or Tex-406-A'!$B$57=\"\",\"\",'Tex-106-E or Tex-406-A'!$B$57)","v":"Liquid Limit - Tex-104-E"},{"$f":"IF('Tex-106-E or Tex-406-A'!$B$58=\"\",\"\",'Tex-106-E or Tex-406-A'!$B$58)","v":""},{"$f":"IF('Tex-106-E or Tex-406-A'!$B$62=\"\",\"\",'Tex-106-E or Tex-406-A'!$B$62)","v":3},{"$f":"IF('Tex-106-E or Tex-406-A'!$E$58=\"\",\"\",'Tex-106-E or Tex-406-A'!$E$58)","v":"Mass of Dry Sample + Tare (g)"}]
[46,{"$f":"IF('Tex-106-E or Tex-406-A'!$F$62=\"\",\"\",'Tex-106-E or Tex-406-A'!$F$62)","v":""},{"$f":"IF('Tex-106-E or Tex-406-A'!$B$57=\"\",\"\",'Tex-106-E or Tex-406-A'!$B$57)","v":"Liquid Limit - Tex-104-E"},{"$f":"IF('Tex-106-E or Tex-406-A'!$B$58=\"\",\"\",'Tex-106-E or Tex-406-A'!$B$58)","v":""},{"$f":"IF('Tex-106-E or Tex-406-A'!$B$62=\"\",\"\",'Tex-106-E or Tex-406-A'!$B$62)","v":3},{"$f":"IF('Tex-106-E or Tex-406-A'!$F$58=\"\",\"\",'Tex-106-E or Tex-406-A'!$F$58)","v":"Tare Mass (g)"}]
[47,{"$f":"IF('Tex-106-E or Tex-406-A'!$G$62=\"\",\"\",'Tex-106-E or Tex-406-A'!$G$62)","v":""},{"$f":"IF('Tex-106-E or Tex-406-A'!$B$57=\"\",\"\",'Tex-106-E or Tex-406-A'!$B$57)","v":"Liquid Limit - Tex-104-E"},{"$f":"IF('Tex-106-E or Tex-406-A'!$B$58=\"\",\"\",'Tex-106-E or Tex-406-A'!$B$58)","v":""},{"$f":"IF('Tex-106-E or Tex-406-A'!$B$62=\"\",\"\",'Tex-106-E or Tex-406-A'!$B$62)","v":3},{"$f":"IF('Tex-106-E or Tex-406-A'!$G$58=\"\",\"\",'Tex-106-E or Tex-406-A'!$G$58)","v":"Moisture Content (%)"}]
[48,{"$f":"IF('Tex-106-E or Tex-406-A'!$H$62=\"\",\"\",'Tex-106-E or Tex-406-A'!$H$62)","v":""},{"$f":"IF('Tex-106-E or Tex-406-A'!$B$57=\"\",\"\",'Tex-106-E or Tex-406-A'!$B$57)","v":"Liquid Limit - Tex-104-E"},{"$f":"IF('Tex-106-E or Tex-406-A'!$B$58=\"\",\"\",'Tex-106-E or Tex-406-A'!$B$58)","v":""},{"$f":"IF('Tex-106-E or Tex-406-A'!$B$62=\"\",\"\",'Tex-106-E or Tex-406-A'!$B$62)","v":3},{"$f":"IF('Tex-106-E or Tex-406-A'!$H$58=\"\",\"\",'Tex-106-E or Tex-406-A'!$H$58)","v":"Number of Blows"}]
[49,{"$f":"IF('Tex-106-E or Tex-406-A'!$I$62=\"\",\"\",'Tex-106-E or Tex-406-A'!$I$62)","v":""},{"$f":"IF('Tex-106-E or Tex-406-A'!$B$57=\"\",\"\",'Tex-106-E or Tex-406-A'!$B$57)","v":"Liquid Limit - Tex-104-E"},{"$f":"IF('Tex-106-E or Tex-406-A'!$B$58=\"\",\"\",'Tex-106-E or Tex-406-A'!$B$58)","v":""},{"$f":"IF('Tex-106-E or Tex-406-A'!$B$62=\"\",\"\",'Tex-106-E or Tex-406-A'!$B$62)","v":3},{"$f":"IF('Tex-106-E or Tex-406-A'!$I$58=\"\",\"\",'Tex-106-E or Tex-406-A'!$I$58)","v":"Liquid Limit (%)"}]
[50,{"$f":"IF('Tex-106-E or Tex-406-A'!$C$63=\"\",\"\",'Tex-106-E or Tex-406-A'!$C$63)","v":""},{"$f":"IF('Tex-106-E or Tex-406-A'!$B$57=\"\",\"\",'Tex-106-E or Tex-406-A'!$B$57)","v":"Liquid Limit - Tex-104-E"},{"$f":"IF('Tex-106-E or Tex-406-A'!$B$58=\"\",\"\",'Tex-106-E or Tex-406-A'!$B$58)","v":""},{"$f":"IF('Tex-106-E or Tex-406-A'!$B$63=\"\",\"\",'Tex-106-E or Tex-406-A'!$B$63)","v":4},{"$f":"IF('Tex-106-E or Tex-406-A'!$C$58=\"\",\"\",'Tex-106-E or Tex-406-A'!$C$58)","v":"Dish No."}]
[51,{"$f":"IF('Tex-106-E or Tex-406-A'!$D$63=\"\",\"\",'Tex-106-E or Tex-406-A'!$D$63)","v":""},{"$f":"IF('Tex-106-E or Tex-406-A'!$B$57=\"\",\"\",'Tex-106-E or Tex-406-A'!$B$57)","v":"Liquid Limit - Tex-104-E"},{"$f":"IF('Tex-106-E or Tex-406-A'!$B$58=\"\",\"\",'Tex-106-E or Tex-406-A'!$B$58)","v":""},{"$f":"IF('Tex-106-E or Tex-406-A'!$B$63=\"\",\"\",'Tex-106-E or Tex-406-A'!$B$63)","v":4},{"$f":"IF('Tex-106-E or Tex-406-A'!$D$58=\"\",\"\",'Tex-106-E or Tex-406-A'!$D$58)","v":"Mass of Wet Sample + Tare (g)"}]
[52,{"$f":"IF('Tex-106-E or Tex-406-A'!$E$63=\"\",\"\",'Tex-106-E or Tex-406-A'!$E$63)","v":""},{"$f":"IF('Tex-106-E or Tex-406-A'!$B$57=\"\",\"\",'Tex-106-E or Tex-406-A'!$B$57)","v":"Liquid Limit - Tex-104-E"},{"$f":"IF('Tex-106-E or Tex-406-A'!$B$58=\"\",\"\",'Tex-106-E or Tex-406-A'!$B$58)","v":""},{"$f":"IF('Tex-106-E or Tex-406-A'!$B$63=\"\",\"\",'Tex-106-E or Tex-406-A'!$B$63)","v":4},{"$f":"IF('Tex-106-E or Tex-406-A'!$E$58=\"\",\"\",'Tex-106-E or Tex-406-A'!$E$58)","v":"Mass of Dry Sample + Tare (g)"}]
[53,{"$f":"IF('Tex-106-E or Tex-406-A'!$F$63=\"\",\"\",'Tex-106-E or Tex-406-A'!$F$63)","v":""},{"$f":"IF('Tex-106-E or Tex-406-A'!$B$57=\"\",\"\",'Tex-106-E or Tex-406-A'!$B$57)","v":"Liquid Limit - Tex-104-E"},{"$f":"IF('Tex-106-E or Tex-406-A'!$B$58=\"\",\"\",'Tex-106-E or Tex-406-A'!$B$58)","v":""},{"$f":"IF('Tex-106-E or Tex-406-A'!$B$63=\"\",\"\",'Tex-106-E or Tex-406-A'!$B$63)","v":4},{"$f":"IF('Tex-106-E or Tex-406-A'!$F$58=\"\",\"\",'Tex-106-E or Tex-406-A'!$F$58)","v":"Tare Mass (g)"}]
[54,{"$f":"IF('Tex-106-E or Tex-406-A'!$G$63=\"\",\"\",'Tex-106-E or Tex-406-A'!$G$63)","v":""},{"$f":"IF('Tex-106-E or Tex-406-A'!$B$57=\"\",\"\",'Tex-106-E or Tex-406-A'!$B$57)","v":"Liquid Limit - Tex-104-E"},{"$f":"IF('Tex-106-E or Tex-406-A'!$B$58=\"\",\"\",'Tex-106-E or Tex-406-A'!$B$58)","v":""},{"$f":"IF('Tex-106-E or Tex-406-A'!$B$63=\"\",\"\",'Tex-106-E or Tex-406-A'!$B$63)","v":4},{"$f":"IF('Tex-106-E or Tex-406-A'!$G$58=\"\",\"\",'Tex-106-E or Tex-406-A'!$G$58)","v":"Moisture Content (%)"}]
[55,{"$f":"IF('Tex-106-E or Tex-406-A'!$H$63=\"\",\"\",'Tex-106-E or Tex-406-A'!$H$63)","v":""},{"$f":"IF('Tex-106-E or Tex-406-A'!$B$57=\"\",\"\",'Tex-106-E or Tex-406-A'!$B$57)","v":"Liquid Limit - Tex-104-E"},{"$f":"IF('Tex-106-E or Tex-406-A'!$B$58=\"\",\"\",'Tex-106-E or Tex-406-A'!$B$58)","v":""},{"$f":"IF('Tex-106-E or Tex-406-A'!$B$63=\"\",\"\",'Tex-106-E or Tex-406-A'!$B$63)","v":4},{"$f":"IF('Tex-106-E or Tex-406-A'!$H$58=\"\",\"\",'Tex-106-E or Tex-406-A'!$H$58)","v":"Number of Blows"}]
[56,{"$f":"IF('Tex-106-E or Tex-406-A'!$I$63=\"\",\"\",'Tex-106-E or Tex-406-A'!$I$63)","v":""},{"$f":"IF('Tex-106-E or Tex-406-A'!$B$57=\"\",\"\",'Tex-106-E or Tex-406-A'!$B$57)","v":"Liquid Limit - Tex-104-E"},{"$f":"IF('Tex-106-E or Tex-406-A'!$B$58=\"\",\"\",'Tex-106-E or Tex-406-A'!$B$58)","v":""},{"$f":"IF('Tex-106-E or Tex-406-A'!$B$63=\"\",\"\",'Tex-106-E or Tex-406-A'!$B$63)","v":4},{"$f":"IF('Tex-106-E or Tex-406-A'!$I$58=\"\",\"\",'Tex-106-E or Tex-406-A'!$I$58)","v":"Liquid Limit (%)"}]
[57,{"$f":"IF('Tex-106-E or Tex-406-A'!$C$64=\"\",\"\",'Tex-106-E or Tex-406-A'!$C$64)","v":""},{"$f":"IF('Tex-106-E or Tex-406-A'!$B$57=\"\",\"\",'Tex-106-E or Tex-406-A'!$B$57)","v":"Liquid Limit - Tex-104-E"},{"$f":"IF('Tex-106-E or Tex-406-A'!$B$58=\"\",\"\",'Tex-106-E or Tex-406-A'!$B$58)","v":""},{"$f":"IF('Tex-106-E or Tex-406-A'!$B$64=\"\",\"\",'Tex-106-E or Tex-406-A'!$B$64)","v":5},{"$f":"IF('Tex-106-E or Tex-406-A'!$C$58=\"\",\"\",'Tex-106-E or Tex-406-A'!$C$58)","v":"Dish No."}]
[58,{"$f":"IF('Tex-106-E or Tex-406-A'!$D$64=\"\",\"\",'Tex-106-E or Tex-406-A'!$D$64)","v":""},{"$f":"IF('Tex-106-E or Tex-406-A'!$B$57=\"\",\"\",'Tex-106-E or Tex-406-A'!$B$57)","v":"Liquid Limit - Tex-104-E"},{"$f":"IF('Tex-106-E or Tex-406-A'!$B$58=\"\",\"\",'Tex-106-E or Tex-406-A'!$B$58)","v":""},{"$f":"IF('Tex-106-E or Tex-406-A'!$B$64=\"\",\"\",'Tex-106-E or Tex-406-A'!$B$64)","v":5},{"$f":"IF('Tex-106-E or Tex-406-A'!$D$58=\"\",\"\",'Tex-106-E or Tex-406-A'!$D$58)","v":"Mass of Wet Sample + Tare (g)"}]
[59,{"$f":"IF('Tex-106-E or Tex-406-A'!$E$64=\"\",\"\",'Tex-106-E or Tex-406-A'!$E$64)","v":""},{"$f":"IF('Tex-106-E or Tex-406-A'!$B$57=\"\",\"\",'Tex-106-E or Tex-406-A'!$B$57)","v":"Liquid Limit - Tex-104-E"},{"$f":"IF('Tex-106-E or Tex-406-A'!$B$58=\"\",\"\",'Tex-106-E or Tex-406-A'!$B$58)","v":""},{"$f":"IF('Tex-106-E or Tex-406-A'!$B$64=\"\",\"\",'Tex-106-E or Tex-406-A'!$B$64)","v":5},{"$f":"IF('Tex-106-E or Tex-406-A'!$E$58=\"\",\"\",'Tex-106-E or Tex-406-A'!$E$58)","v":"Mass of Dry Sample + Tare (g)"}]
[60,{"$f":"IF('Tex-106-E or Tex-406-A'!$F$64=\"\",\"\",'Tex-106-E or Tex-406-A'!$F$64)","v":""},{"$f":"IF('Tex-106-E or Tex-406-A'!$B$57=\"\",\"\",'Tex-106-E or Tex-406-A'!$B$57)","v":"Liquid Limit - Tex-104-E"},{"$f":"IF('Tex-106-E or Tex-406-A'!$B$58=\"\",\"\",'Tex-106-E or Tex-406-A'!$B$58)","v":""},{"$f":"IF('Tex-106-E or Tex-406-A'!$B$64=\"\",\"\",'Tex-106-E or Tex-406-A'!$B$64)","v":5},{"$f":"IF('Tex-106-E or Tex-406-A'!$F$58=\"\",\"\",'Tex-106-E or Tex-406-A'!$F$58)","v":"Tare Mass (g)"}]
[61,{"$f":"IF('Tex-106-E or Tex-406-A'!$G$64=\"\",\"\",'Tex-106-E or Tex-406-A'!$G$64)","v":""},{"$f":"IF('Tex-106-E or Tex-406-A'!$B$57=\"\",\"\",'Tex-106-E or Tex-406-A'!$B$57)","v":"Liquid Limit - Tex-104-E"},{"$f":"IF('Tex-106-E or Tex-406-A'!$B$58=\"\",\"\",'Tex-106-E or Tex-406-A'!$B$58)","v":""},{"$f":"IF('Tex-106-E or Tex-406-A'!$B$64=\"\",\"\",'Tex-106-E or Tex-406-A'!$B$64)","v":5},{"$f":"IF('Tex-106-E or Tex-406-A'!$G$58=\"\",\"\",'Tex-106-E or Tex-406-A'!$G$58)","v":"Moisture Content (%)"}]
[62,{"$f":"IF('Tex-106-E or Tex-406-A'!$H$64=\"\",\"\",'Tex-106-E or Tex-406-A'!$H$64)","v":""},{"$f":"IF('Tex-106-E or Tex-406-A'!$B$57=\"\",\"\",'Tex-106-E or Tex-406-A'!$B$57)","v":"Liquid Limit - Tex-104-E"},{"$f":"IF('Tex-106-E or Tex-406-A'!$B$58=\"\",\"\",'Tex-106-E or Tex-406-A'!$B$58)","v":""},{"$f":"IF('Tex-106-E or Tex-406-A'!$B$64=\"\",\"\",'Tex-106-E or Tex-406-A'!$B$64)","v":5},{"$f":"IF('Tex-106-E or Tex-406-A'!$H$58=\"\",\"\",'Tex-106-E or Tex-406-A'!$H$58)","v":"Number of Blows"}]
[63,{"$f":"IF('Tex-106-E or Tex-406-A'!$I$64=\"\",\"\",'Tex-106-E or Tex-406-A'!$I$64)","v":""},{"$f":"IF('Tex-106-E or Tex-406-A'!$B$57=\"\",\"\",'Tex-106-E or Tex-406-A'!$B$57)","v":"Liquid Limit - Tex-104-E"},{"$f":"IF('Tex-106-E or Tex-406-A'!$B$58=\"\",\"\",'Tex-106-E or Tex-406-A'!$B$58)","v":""},{"$f":"IF('Tex-106-E or Tex-406-A'!$B$64=\"\",\"\",'Tex-106-E or Tex-406-A'!$B$64)","v":5},{"$f":"IF('Tex-106-E or Tex-406-A'!$I$58=\"\",\"\",'Tex-106-E or Tex-406-A'!$I$58)","v":"Liquid Limit (%)"}]
[64,{"$f":"IF('Tex-106-E or Tex-406-A'!$C$65=\"\",\"\",'Tex-106-E or Tex-406-A'!$C$65)","v":""},{"$f":"IF('Tex-106-E or Tex-406-A'!$B$57=\"\",\"\",'Tex-106-E or Tex-406-A'!$B$57)","v":"Liquid Limit - Tex-104-E"},{"$f":"IF('Tex-106-E or Tex-406-A'!$B$58=\"\",\"\",'Tex-106-E or Tex-406-A'!$B$58)","v":""},{"$f":"IF('Tex-106-E or Tex-406-A'!$B$65=\"\",\"\",'Tex-106-E or Tex-406-A'!$B$65)","v":6},{"$f":"IF('Tex-106-E or Tex-406-A'!$C$58=\"\",\"\",'Tex-106-E or Tex-406-A'!$C$58)","v":"Dish No."}]
[65,{"$f":"IF('Tex-106-E or Tex-406-A'!$D$65=\"\",\"\",'Tex-106-E or Tex-406-A'!$D$65)","v":""},{"$f":"IF('Tex-106-E or Tex-406-A'!$B$57=\"\",\"\",'Tex-106-E or Tex-406-A'!$B$57)","v":"Liquid Limit - Tex-104-E"},{"$f":"IF('Tex-106-E or Tex-406-A'!$B$58=\"\",\"\",'Tex-106-E or Tex-406-A'!$B$58)","v":""},{"$f":"IF('Tex-106-E or Tex-406-A'!$B$65=\"\",\"\",'Tex-106-E or Tex-406-A'!$B$65)","v":6},{"$f":"IF('Tex-106-E or Tex-406-A'!$D$58=\"\",\"\",'Tex-106-E or Tex-406-A'!$D$58)","v":"Mass of Wet Sample + Tare (g)"}]
[66,{"$f":"IF('Tex-106-E or Tex-406-A'!$E$65=\"\",\"\",'Tex-106-E or Tex-406-A'!$E$65)","v":""},{"$f":"IF('Tex-106-E or Tex-406-A'!$B$57=\"\",\"\",'Tex-106-E or Tex-406-A'!$B$57)","v":"Liquid Limit - Tex-104-E"},{"$f":"IF('Tex-106-E or Tex-406-A'!$B$58=\"\",\"\",'Tex-106-E or Tex-406-A'!$B$58)","v":""},{"$f":"IF('Tex-106-E or Tex-406-A'!$B$65=\"\",\"\",'Tex-106-E or Tex-406-A'!$B$65)","v":6},{"$f":"IF('Tex-106-E or Tex-406-A'!$E$58=\"\",\"\",'Tex-106-E or Tex-406-A'!$E$58)","v":"Mass of Dry Sample + Tare (g)"}]
[67,{"$f":"IF('Tex-106-E or Tex-406-A'!$F$65=\"\",\"\",'Tex-106-E or Tex-406-A'!$F$65)","v":""},{"$f":"IF('Tex-106-E or Tex-406-A'!$B$57=\"\",\"\",'Tex-106-E or Tex-406-A'!$B$57)","v":"Liquid Limit - Tex-104-E"},{"$f":"IF('Tex-106-E or Tex-406-A'!$B$58=\"\",\"\",'Tex-106-E or Tex-406-A'!$B$58)","v":""},{"$f":"IF('Tex-106-E or Tex-406-A'!$B$65=\"\",\"\",'Tex-106-E or Tex-406-A'!$B$65)","v":6},{"$f":"IF('Tex-106-E or Tex-406-A'!$F$58=\"\",\"\",'Tex-106-E or Tex-406-A'!$F$58)","v":"Tare Mass (g)"}]
[68,{"$f":"IF('Tex-106-E or Tex-406-A'!$G$65=\"\",\"\",'Tex-106-E or Tex-406-A'!$G$65)","v":""},{"$f":"IF('Tex-106-E or Tex-406-A'!$B$57=\"\",\"\",'Tex-106-E or Tex-406-A'!$B$57)","v":"Liquid Limit - Tex-104-E"},{"$f":"IF('Tex-106-E or Tex-406-A'!$B$58=\"\",\"\",'Tex-106-E or Tex-406-A'!$B$58)","v":""},{"$f":"IF('Tex-106-E or Tex-406-A'!$B$65=\"\",\"\",'Tex-106-E or Tex-406-A'!$B$65)","v":6},{"$f":"IF('Tex-106-E or Tex-406-A'!$G$58=\"\",\"\",'Tex-106-E or Tex-406-A'!$G$58)","v":"Moisture Content (%)"}]
[69,{"$f":"IF('Tex-106-E or Tex-406-A'!$H$65=\"\",\"\",'Tex-106-E or Tex-406-A'!$H$65)","v":""},{"$f":"IF('Tex-106-E or Tex-406-A'!$B$57=\"\",\"\",'Tex-106-E or Tex-406-A'!$B$57)","v":"Liquid Limit - Tex-104-E"},{"$f":"IF('Tex-106-E or Tex-406-A'!$B$58=\"\",\"\",'Tex-106-E or Tex-406-A'!$B$58)","v":""},{"$f":"IF('Tex-106-E or Tex-406-A'!$B$65=\"\",\"\",'Tex-106-E or Tex-406-A'!$B$65)","v":6},{"$f":"IF('Tex-106-E or Tex-406-A'!$H$58=\"\",\"\",'Tex-106-E or Tex-406-A'!$H$58)","v":"Number of Blows"}]
[70,{"$f":"IF('Tex-106-E or Tex-406-A'!$I$65=\"\",\"\",'Tex-106-E or Tex-406-A'!$I$65)","v":""},{"$f":"IF('Tex-106-E or Tex-406-A'!$B$57=\"\",\"\",'Tex-106-E or Tex-406-A'!$B$57)","v":"Liquid Limit - Tex-104-E"},{"$f":"IF('Tex-106-E or Tex-406-A'!$B$58=\"\",\"\",'Tex-106-E or Tex-406-A'!$B$58)","v":""},{"$f":"IF('Tex-106-E or Tex-406-A'!$B$65=\"\",\"\",'Tex-106-E or Tex-406-A'!$B$65)","v":6},{"$f":"IF('Tex-106-E or Tex-406-A'!$I$58=\"\",\"\",'Tex-106-E or Tex-406-A'!$I$58)","v":"Liquid Limit (%)"}]
[71,{"$f":"IF('Tex-106-E or Tex-406-A'!$I$66=\"\",\"\",'Tex-106-E or Tex-406-A'!$I$66)","v":""},{"$f":"IF('Tex-106-E or Tex-406-A'!$B$57=\"\",\"\",'Tex-106-E or Tex-406-A'!$B$57)","v":"Liquid Limit - Tex-104-E"},{"$f":"IF('Tex-106-E or Tex-406-A'!$H$66=\"\",\"\",'Tex-106-E or Tex-406-A'!$H$66)","v":"Liquid Limit"}]
[72,{"$f":"IF('Tex-106-E or Tex-406-A'!$C$71=\"\",\"\",'Tex-106-E or Tex-406-A'!$C$71)","v":""},{"$f":"IF('Tex-106-E or Tex-406-A'!$B$68=\"\",\"\",'Tex-106-E or Tex-406-A'!$B$68)","v":"Plastic Limit - Tex-105-E"},{"$f":"IF('Tex-106-E or Tex-406-A'!$B$69=\"\",\"\",'Tex-106-E or Tex-406-A'!$B$69)","v":""},{"$f":"IF('Tex-106-E or Tex-406-A'!$B$71=\"\",\"\",'Tex-106-E or Tex-406-A'!$B$71)","v":1},{"$f":"IF('Tex-106-E or Tex-406-A'!$C$69=\"\",\"\",'Tex-106-E or Tex-406-A'!$C$69)","v":"Dish No."}]
[73,{"$f":"IF('Tex-106-E or Tex-406-A'!$D$71=\"\",\"\",'Tex-106-E or Tex-406-A'!$D$71)","v":""},{"$f":"IF('Tex-106-E or Tex-406-A'!$B$68=\"\",\"\",'Tex-106-E or Tex-406-A'!$B$68)","v":"Plastic Limit - Tex-105-E"},{"$f":"IF('Tex-106-E or Tex-406-A'!$B$69=\"\",\"\",'Tex-106-E or Tex-406-A'!$B$69)","v":""},{"$f":"IF('Tex-106-E or Tex-406-A'!$B$71=\"\",\"\",'Tex-106-E or Tex-406-A'!$B$71)","v":1},{"$f":"IF('Tex-106-E or Tex-406-A'!$D$69=\"\",\"\",'Tex-106-E or Tex-406-A'!$D$69)","v":"Mass of Wet Sample + Tare (g)"}]
[74,{"$f":"IF('Tex-106-E or Tex-406-A'!$E$71=\"\",\"\",'Tex-106-E or Tex-406-A'!$E$71)","v":""},{"$f":"IF('Tex-106-E or Tex-406-A'!$B$68=\"\",\"\",'Tex-106-E or Tex-406-A'!$B$68)","v":"Plastic Limit - Tex-105-E"},{"$f":"IF('Tex-106-E or Tex-406-A'!$B$69=\"\",\"\",'Tex-106-E or Tex-406-A'!$B$69)","v":""},{"$f":"IF('Tex-106-E or Tex-406-A'!$B$71=\"\",\"\",'Tex-106-E or Tex-406-A'!$B$71)","v":1},{"$f":"IF('Tex-106-E or Tex-406-A'!$E$69=\"\",\"\",'Tex-106-E or Tex-406-A'!$E$69)","v":"Mass of Dry Sample + Tare (g)"}]
[75,{"$f":"IF('Tex-106-E or Tex-406-A'!$F$71=\"\",\"\",'Tex-106-E or Tex-406-A'!$F$71)","v":""},{"$f":"IF('Tex-106-E or Tex-406-A'!$B$68=\"\",\"\",'Tex-106-E or Tex-406-A'!$B$68)","v":"Plastic Limit - Tex-105-E"},{"$f":"IF('Tex-106-E or Tex-406-A'!$B$69=\"\",\"\",'Tex-106-E or Tex-406-A'!$B$69)","v":""},{"$f":"IF('Tex-106-E or Tex-406-A'!$B$71=\"\",\"\",'Tex-106-E or Tex-406-A'!$B$71)","v":1},{"$f":"IF('Tex-106-E or Tex-406-A'!$F$69=\"\",\"\",'Tex-106-E or Tex-406-A'!$F$69)","v":"Tare Mass (g)"}]
[76,{"$f":"IF('Tex-106-E or Tex-406-A'!$G$71=\"\",\"\",'Tex-106-E or Tex-406-A'!$G$71)","v":""},{"$f":"IF('Tex-106-E or Tex-406-A'!$B$68=\"\",\"\",'Tex-106-E or Tex-406-A'!$B$68)","v":"Plastic Limit - Tex-105-E"},{"$f":"IF('Tex-106-E or Tex-406-A'!$B$69=\"\",\"\",'Tex-106-E or Tex-406-A'!$B$69)","v":""},{"$f":"IF('Tex-106-E or Tex-406-A'!$B$71=\"\",\"\",'Tex-106-E or Tex-406-A'!$B$71)","v":1},{"$f":"IF('Tex-106-E or Tex-406-A'!$G$69=\"\",\"\",'Tex-106-E or Tex-406-A'!$G$69)","v":"Mass of Water (g)"}]
[77,{"$f":"IF('Tex-106-E or Tex-406-A'!$H$71=\"\",\"\",'Tex-106-E or Tex-406-A'!$H$71)","v":""},{"$f":"IF('Tex-106-E or Tex-406-A'!$B$68=\"\",\"\",'Tex-106-E or Tex-406-A'!$B$68)","v":"Plastic Limit - Tex-105-E"},{"$f":"IF('Tex-106-E or Tex-406-A'!$B$69=\"\",\"\",'Tex-106-E or Tex-406-A'!$B$69)","v":""},{"$f":"IF('Tex-106-E or Tex-406-A'!$B$71=\"\",\"\",'Tex-106-E or Tex-406-A'!$B$71)","v":1},{"$f":"IF('Tex-106-E or Tex-406-A'!$H$69=\"\",\"\",'Tex-106-E or Tex-406-A'!$H$69)","v":"Plastic Limit (%)"}]
[78,{"$f":"IF('Tex-106-E or Tex-406-A'!$C$72=\"\",\"\",'Tex-106-E or Tex-406-A'!$C$72)","v":""},{"$f":"IF('Tex-106-E or Tex-406-A'!$B$68=\"\",\"\",'Tex-106-E or Tex-406-A'!$B$68)","v":"Plastic Limit - Tex-105-E"},{"$f":"IF('Tex-106-E or Tex-406-A'!$B$69=\"\",\"\",'Tex-106-E or Tex-406-A'!$B$69)","v":""},{"$f":"IF('Tex-106-E or Tex-406-A'!$B$72=\"\",\"\",'Tex-106-E or Tex-406-A'!$B$72)","v":2},{"$f":"IF('Tex-106-E or Tex-406-A'!$C$69=\"\",\"\",'Tex-106-E or Tex-406-A'!$C$69)","v":"Dish No."}]
[79,{"$f":"IF('Tex-106-E or Tex-406-A'!$D$72=\"\",\"\",'Tex-106-E or Tex-406-A'!$D$72)","v":""},{"$f":"IF('Tex-106-E or Tex-406-A'!$B$68=\"\",\"\",'Tex-106-E or Tex-406-A'!$B$68)","v":"Plastic Limit - Tex-105-E"},{"$f":"IF('Tex-106-E or Tex-406-A'!$B$69=\"\",\"\",'Tex-106-E or Tex-406-A'!$B$69)","v":""},{"$f":"IF('Tex-106-E or Tex-406-A'!$B$72=\"\",\"\",'Tex-106-E or Tex-406-A'!$B$72)","v":2},{"$f":"IF('Tex-106-E or Tex-406-A'!$D$69=\"\",\"\",'Tex-106-E or Tex-406-A'!$D$69)","v":"Mass of Wet Sample + Tare (g)"}]
[80,{"$f":"IF('Tex-106-E or Tex-406-A'!$E$72=\"\",\"\",'Tex-106-E or Tex-406-A'!$E$72)","v":""},{"$f":"IF('Tex-106-E or Tex-406-A'!$B$68=\"\",\"\",'Tex-106-E or Tex-406-A'!$B$68)","v":"Plastic Limit - Tex-105-E"},{"$f":"IF('Tex-106-E or Tex-406-A'!$B$69=\"\",\"\",'Tex-106-E or Tex-406-A'!$B$69)","v":""},{"$f":"IF('Tex-106-E or Tex-406-A'!$B$72=\"\",\"\",'Tex-106-E or Tex-406-A'!$B$72)","v":2},{"$f":"IF('Tex-106-E or Tex-406-A'!$E$69=\"\",\"\",'Tex-106-E or Tex-406-A'!$E$69)","v":"Mass of Dry Sample + Tare (g)"}]
[81,{"$f":"IF('Tex-106-E or Tex-406-A'!$F$72=\"\",\"\",'Tex-106-E or Tex-406-A'!$F$72)","v":""},{"$f":"IF('Tex-106-E or Tex-406-A'!$B$68=\"\",\"\",'Tex-106-E or Tex-406-A'!$B$68)","v":"Plastic Limit - Tex-105-E"},{"$f":"IF('Tex-106-E or Tex-406-A'!$B$69=\"\",\"\",'Tex-106-E or Tex-406-A'!$B$69)","v":""},{"$f":"IF('Tex-106-E or Tex-406-A'!$B$72=\"\",\"\",'Tex-106-E or Tex-406-A'!$B$72)","v":2},{"$f":"IF('Tex-106-E or Tex-406-A'!$F$69=\"\",\"\",'Tex-106-E or Tex-406-A'!$F$69)","v":"Tare Mass (g)"}]
[82,{"$f":"IF('Tex-106-E or Tex-406-A'!$G$72=\"\",\"\",'Tex-106-E or Tex-406-A'!$G$72)","v":""},{"$f":"IF('Tex-106-E or Tex-406-A'!$B$68=\"\",\"\",'Tex-106-E or Tex-406-A'!$B$68)","v":"Plastic Limit - Tex-105-E"},{"$f":"IF('Tex-106-E or Tex-406-A'!$B$69=\"\",\"\",'Tex-106-E or Tex-406-A'!$B$69)","v":""},{"$f":"IF('Tex-106-E or Tex-406-A'!$B$72=\"\",\"\",'Tex-106-E or Tex-406-A'!$B$72)","v":2},{"$f":"IF('Tex-106-E or Tex-406-A'!$G$69=\"\",\"\",'Tex-106-E or Tex-406-A'!$G$69)","v":"Mass of Water (g)"}]
[83,{"$f":"IF('Tex-106-E or Tex-406-A'!$H$72=\"\",\"\",'Tex-106-E or Tex-406-A'!$H$72)","v":""},{"$f":"IF('Tex-106-E or Tex-406-A'!$B$68=\"\",\"\",'Tex-106-E or Tex-406-A'!$B$68)","v":"Plastic Limit - Tex-105-E"},{"$f":"IF('Tex-106-E or Tex-406-A'!$B$69=\"\",\"\",'Tex-106-E or Tex-406-A'!$B$69)","v":""},{"$f":"IF('Tex-106-E or Tex-406-A'!$B$72=\"\",\"\",'Tex-106-E or Tex-406-A'!$B$72)","v":2},{"$f":"IF('Tex-106-E or Tex-406-A'!$H$69=\"\",\"\",'Tex-106-E or Tex-406-A'!$H$69)","v":"Plastic Limit (%)"}]
[84,{"$f":"IF('Tex-106-E or Tex-406-A'!$C$73=\"\",\"\",'Tex-106-E or Tex-406-A'!$C$73)","v":""},{"$f":"IF('Tex-106-E or Tex-406-A'!$B$68=\"\",\"\",'Tex-106-E or Tex-406-A'!$B$68)","v":"Plastic Limit - Tex-105-E"},{"$f":"IF('Tex-106-E or Tex-406-A'!$B$69=\"\",\"\",'Tex-106-E or Tex-406-A'!$B$69)","v":""},{"$f":"IF('Tex-106-E or Tex-406-A'!$B$73=\"\",\"\",'Tex-106-E or Tex-406-A'!$B$73)","v":3},{"$f":"IF('Tex-106-E or Tex-406-A'!$C$69=\"\",\"\",'Tex-106-E or Tex-406-A'!$C$69)","v":"Dish No."}]
[85,{"$f":"IF('Tex-106-E or Tex-406-A'!$D$73=\"\",\"\",'Tex-106-E or Tex-406-A'!$D$73)","v":""},{"$f":"IF('Tex-106-E or Tex-406-A'!$B$68=\"\",\"\",'Tex-106-E or Tex-406-A'!$B$68)","v":"Plastic Limit - Tex-105-E"},{"$f":"IF('Tex-106-E or Tex-406-A'!$B$69=\"\",\"\",'Tex-106-E or Tex-406-A'!$B$69)","v":""},{"$f":"IF('Tex-106-E or Tex-406-A'!$B$73=\"\",\"\",'Tex-106-E or Tex-406-A'!$B$73)","v":3},{"$f":"IF('Tex-106-E or Tex-406-A'!$D$69=\"\",\"\",'Tex-106-E or Tex-406-A'!$D$69)","v":"Mass of Wet Sample + Tare (g)"}]
[86,{"$f":"IF('Tex-106-E or Tex-406-A'!$E$73=\"\",\"\",'Tex-106-E or Tex-406-A'!$E$73)","v":""},{"$f":"IF('Tex-106-E or Tex-406-A'!$B$68=\"\",\"\",'Tex-106-E or Tex-406-A'!$B$68)","v":"Plastic Limit - Tex-105-E"},{"$f":"IF('Tex-106-E or Tex-406-A'!$B$69=\"\",\"\",'Tex-106-E or Tex-406-A'!$B$69)","v":""},{"$f":"IF('Tex-106-E or Tex-406-A'!$B$73=\"\",\"\",'Tex-106-E or Tex-406-A'!$B$73)","v":3},{"$f":"IF('Tex-106-E or Tex-406-A'!$E$69=\"\",\"\",'Tex-106-E or Tex-406-A'!$E$69)","v":"Mass of Dry Sample + Tare (g)"}]
[87,{"$f":"IF('Tex-106-E or Tex-406-A'!$F$73=\"\",\"\",'Tex-106-E or Tex-406-A'!$F$73)","v":""},{"$f":"IF('Tex-106-E or Tex-406-A'!$B$68=\"\",\"\",'Tex-106-E or Tex-406-A'!$B$68)","v":"Plastic Limit - Tex-105-E"},{"$f":"IF('Tex-106-E or Tex-406-A'!$B$69=\"\",\"\",'Tex-106-E or Tex-406-A'!$B$69)","v":""},{"$f":"IF('Tex-106-E or Tex-406-A'!$B$73=\"\",\"\",'Tex-106-E or Tex-406-A'!$B$73)","v":3},{"$f":"IF('Tex-106-E or Tex-406-A'!$F$69=\"\",\"\",'Tex-106-E or Tex-406-A'!$F$69)","v":"Tare Mass (g)"}]
[88,{"$f":"IF('Tex-106-E or Tex-406-A'!$G$73=\"\",\"\",'Tex-106-E or Tex-406-A'!$G$73)","v":""},{"$f":"IF('Tex-106-E or Tex-406-A'!$B$68=\"\",\"\",'Tex-106-E or Tex-406-A'!$B$68)","v":"Plastic Limit - Tex-105-E"},{"$f":"IF('Tex-106-E or Tex-406-A'!$B$69=\"\",\"\",'Tex-106-E or Tex-406-A'!$B$69)","v":""},{"$f":"IF('Tex-106-E or Tex-406-A'!$B$73=\"\",\"\",'Tex-106-E or Tex-406-A'!$B$73)","v":3},{"$f":"IF('Tex-106-E or Tex-406-A'!$G$69=\"\",\"\",'Tex-106-E or Tex-406-A'!$G$69)","v":"Mass of Water (g)"}]
[89,{"$f":"IF('Tex-106-E or Tex-406-A'!$H$73=\"\",\"\",'Tex-106-E or Tex-406-A'!$H$73)","v":""},{"$f":"IF('Tex-106-E or Tex-406-A'!$B$68=\"\",\"\",'Tex-106-E or Tex-406-A'!$B$68)","v":"Plastic Limit - Tex-105-E"},{"$f":"IF('Tex-106-E or Tex-406-A'!$B$69=\"\",\"\",'Tex-106-E or Tex-406-A'!$B$69)","v":""},{"$f":"IF('Tex-106-E or Tex-406-A'!$B$73=\"\",\"\",'Tex-106-E or Tex-406-A'!$B$73)","v":3},{"$f":"IF('Tex-106-E or Tex-406-A'!$H$69=\"\",\"\",'Tex-106-E or Tex-406-A'!$H$69)","v":"Plastic Limit (%)"}]
[90,{"$f":"IF('Tex-106-E or Tex-406-A'!$H$74=\"\",\"\",'Tex-106-E or Tex-406-A'!$H$74)","v":""},{"$f":"IF('Tex-106-E or Tex-406-A'!$B$68=\"\",\"\",'Tex-106-E or Tex-406-A'!$B$68)","v":"Plastic Limit - Tex-105-E"},{"$f":"IF('Tex-106-E or Tex-406-A'!$G$74=\"\",\"\",'Tex-106-E or Tex-406-A'!$G$74)","v":"Plastic Limit"}]
[91,{"$f":"IF('Tex-106-E or Tex-406-A'!$G$77=\"\",\"\",'Tex-106-E or Tex-406-A'!$G$77)","v":""},{"$f":"IF('Tex-106-E or Tex-406-A'!$B$76=\"\",\"\",'Tex-106-E or Tex-406-A'!$B$76)","v":"Plasticity Index - Tex-106-E"},{"$f":"IF('Tex-106-E or Tex-406-A'!$C$77=\"\",\"\",'Tex-106-E or Tex-406-A'!$C$77)","v":"Plasticity Index:"}]
[92,{"$f":"IF('Tex-106-E or Tex-406-A'!$G$79=\"\",\"\",'Tex-106-E or Tex-406-A'!$G$79)","v":""},{"$f":"IF('Tex-106-E or Tex-406-A'!$B$76=\"\",\"\",'Tex-106-E or Tex-406-A'!$B$76)","v":"Plasticity Index - Tex-106-E"},{"$f":"IF('Tex-106-E or Tex-406-A'!$F$79=\"\",\"\",'Tex-106-E or Tex-406-A'!$F$79)","v":"Calculate Plasticity Index from Bar Linear Shrinkage?"}]
[93,{"$f":"IF('Tex-106-E or Tex-406-A'!$D$84=\"\",\"\",'Tex-106-E or Tex-406-A'!$D$84)","v":""},{"$f":"IF('Tex-106-E or Tex-406-A'!$D$81=\"\",\"\",'Tex-106-E or Tex-406-A'!$D$81)","v":"Bar Linear Shrinkage - Tex-107-E"},{"$f":"IF('Tex-106-E or Tex-406-A'!$D$82=\"\",\"\",'Tex-106-E or Tex-406-A'!$D$82)","v":"Unit"}]
[94,{"$f":"IF('Tex-106-E or Tex-406-A'!$E$84=\"\",\"\",'Tex-106-E or Tex-406-A'!$E$84)","v":""},{"$f":"IF('Tex-106-E or Tex-406-A'!$D$81=\"\",\"\",'Tex-106-E or Tex-406-A'!$D$81)","v":"Bar Linear Shrinkage - Tex-107-E"},{"$f":"IF('Tex-106-E or Tex-406-A'!$E$82=\"\",\"\",'Tex-106-E or Tex-406-A'!$E$82)","v":"Initial Length ()"}]
[95,{"$f":"IF('Tex-106-E or Tex-406-A'!$F$84=\"\",\"\",'Tex-106-E or Tex-406-A'!$F$84)","v":""},{"$f":"IF('Tex-106-E or Tex-406-A'!$D$81=\"\",\"\",'Tex-106-E or Tex-406-A'!$D$81)","v":"Bar Linear Shrinkage - Tex-107-E"},{"$f":"IF('Tex-106-E or Tex-406-A'!$F$82=\"\",\"\",'Tex-106-E or Tex-406-A'!$F$82)","v":"Final Length ()"}]
[96,{"$f":"IF('Tex-106-E or Tex-406-A'!$G$84=\"\",\"\",'Tex-106-E or Tex-406-A'!$G$84)","v":""},{"$f":"IF('Tex-106-E or Tex-406-A'!$D$81=\"\",\"\",'Tex-106-E or Tex-406-A'!$D$81)","v":"Bar Linear Shrinkage - Tex-107-E"},{"$f":"IF('Tex-106-E or Tex-406-A'!$G$82=\"\",\"\",'Tex-106-E or Tex-406-A'!$G$82)","v":"Linear Shrinkage"}]

{"sheet":"Calculations","index":3,"n_rows":18,"n_cols":4,"rows_kept":18,"cut":false,"hidden":true,"merged":[[9,0,9,1],[11,1,12,1],[11,2,12,2],[11,0,12,0]]}
[]
[null,"Raw Data","Best Fit Data"]
["Blows","Moisture Content","Moisture Content"]
[{"$f":"IF('Tex-106-E or Tex-406-A'!H60=\"\",\"\",'Tex-106-E or Tex-406-A'!H60)","v":""},{"$f":"'Tex-106-E or Tex-406-A'!G60","v":""},{"$f":"IF($B4=\"\",\"\",INDEX((LINEST(INDIRECT(\"$b$4:$b\"&(9-COUNTBLANK($A$4:$A$9))),LN(INDIRECT(\"$A$4:$A\"&(9-COUNTBLANK($A$4:$A$9)))),TRUE,TRUE)),1)*LN($A$4)+INDEX(LINEST(INDIRECT(\"$b4:$b\"&(9-COUNTBLANK($A$4:$A$9))),LN(INDIRECT(\"$A$4:$A\"&(9-COUNTBLANK($A$4:$A$9))))),2))","v":""},{"$f":"COUNTBLANK($A$4:$A$9)","v":6}]
[{"$f":"IF('Tex-106-E or Tex-406-A'!H61=\"\",\"\",'Tex-106-E or Tex-406-A'!H61)","v":""},{"$f":"'Tex-106-E or Tex-406-A'!G61","v":""},{"$f":"IF($B5=\"\",\"\",INDEX((LINEST(INDIRECT(\"$b$4:$b\"&(9-COUNTBLANK($A$4:$A$9))),LN(INDIRECT(\"$A$4:$A\"&(9-COUNTBLANK($A$4:$A$9)))),TRUE,TRUE)),1)*LN($A$5)+INDEX(LINEST(INDIRECT(\"$b4:$b\"&(9-COUNTBLANK($A$4:$A$9))),LN(INDIRECT(\"$A$4:$A\"&(9-COUNTBLANK($A$4:$A$9))))),2))","v":""}]
[{"$f":"IF('Tex-106-E or Tex-406-A'!H62=\"\",\"\",'Tex-106-E or Tex-406-A'!H62)","v":""},{"$f":"'Tex-106-E or Tex-406-A'!G62","v":""},{"$f":"IF($B6=\"\",\"\",INDEX((LINEST(INDIRECT(\"$b$4:$b\"&(9-COUNTBLANK($A$4:$A$9))),LN(INDIRECT(\"$A$4:$A\"&(9-COUNTBLANK($A$4:$A$9)))),TRUE,TRUE)),1)*LN($A$6)+INDEX(LINEST(INDIRECT(\"$b4:$b\"&(9-COUNTBLANK($A$4:$A$9))),LN(INDIRECT(\"$A$4:$A\"&(9-COUNTBLANK($A$4:$A$9))))),2))","v":""}]
[{"$f":"IF('Tex-106-E or Tex-406-A'!H63=\"\",\"\",'Tex-106-E or Tex-406-A'!H63)","v":""},{"$f":"'Tex-106-E or Tex-406-A'!G63","v":""},{"$f":"IF($B7=\"\",\"\",INDEX((LINEST(INDIRECT(\"$b$4:$b\"&(9-COUNTBLANK($A$4:$A$9))),LN(INDIRECT(\"$A$4:$A\"&(9-COUNTBLANK($A$4:$A$9)))),TRUE,TRUE)),1)*LN($A$7)+INDEX(LINEST(INDIRECT(\"$b4:$b\"&(9-COUNTBLANK($A$4:$A$9))),LN(INDIRECT(\"$A$4:$A\"&(9-COUNTBLANK($A$4:$A$9))))),2))","v":""}]
[{"$f":"IF('Tex-106-E or Tex-406-A'!H64=\"\",\"\",'Tex-106-E or Tex-406-A'!H64)","v":""},{"$f":"'Tex-106-E or Tex-406-A'!G64","v":""},{"$f":"IF($B8=\"\",\"\",INDEX((LINEST(INDIRECT(\"$b$4:$b\"&(9-COUNTBLANK($A$4:$A$9))),LN(INDIRECT(\"$A$4:$A\"&(9-COUNTBLANK($A$4:$A$9)))),TRUE,TRUE)),1)*LN($A$8)+INDEX(LINEST(INDIRECT(\"$b4:$b\"&(9-COUNTBLANK($A$4:$A$9))),LN(INDIRECT(\"$A$4:$A\"&(9-COUNTBLANK($A$4:$A$9))))),2))","v":""}]
[{"$f":"IF('Tex-106-E or Tex-406-A'!H65=\"\",\"\",'Tex-106-E or Tex-406-A'!H65)","v":""},{"$f":"'Tex-106-E or Tex-406-A'!G65","v":""},{"$f":"IF($B9=\"\",\"\",INDEX((LINEST(INDIRECT(\"$b$4:$b\"&(9-COUNTBLANK($A$4:$A$9))),LN(INDIRECT(\"$A$4:$A\"&(9-COUNTBLANK($A$4:$A$9)))),TRUE,TRUE)),1)*LN($A$9)+INDEX(LINEST(INDIRECT(\"$b4:$b\"&(9-COUNTBLANK($A$4:$A$9))),LN(INDIRECT(\"$A$4:$A\"&(9-COUNTBLANK($A$4:$A$9))))),2))","v":""}]
["Moisture Content @ No. Blows = 25 from Best Fit Equation",null,{"$f":"INDEX((LINEST(INDIRECT(\"$b$4:$b\"&(9-COUNTBLANK($A$4:$A$9))),LN(INDIRECT(\"$A$4:$A\"&(9-COUNTBLANK($A$4:$A$9)))),TRUE,TRUE)),1)*LN(25)+INDEX(LINEST(INDIRECT(\"$b4:$b\"&(9-COUNTBLANK($A$4:$A$9))),LN(INDIRECT(\"$A$4:$A\"&(9-COUNTBLANK($A$4:$A$9))))),2)","v":{"$error":"#VALUE!"}}]
[]
["size","Cumulative Percent Retained","Cumulative Percent Passing"]
["size"]
[{"$f":"IF(ISERROR(INDEX(INDIRECT(\"grade\"&Grade),1,2)),\"\",INDEX(INDIRECT(\"grade\"&Grade),1,2))","v":""},{"$f":"'Tex-106-E or Tex-406-A'!#REF!","v":{"$error":"#REF!"}},{"$f":"IF(B14=\"\",\"\",100-B14)","v":{"$error":"#REF!"}}]
[{"$f":"IF(ISERROR(INDEX(INDIRECT(\"grade\"&Grade),2,2)),\"\",INDEX(INDIRECT(\"grade\"&Grade),2,2))","v":""},{"$f":"'Tex-106-E or Tex-406-A'!#REF!","v":{"$error":"#REF!"}},{"$f":"IF(B15=\"\",\"\",100-B15)","v":{"$error":"#REF!"}}]
[{"$f":"IF(ISERROR(INDEX(INDIRECT(\"grade\"&Grade),3,2)),\"\",INDEX(INDIRECT(\"grade\"&Grade),3,2))","v":""},{"$f":"'Tex-106-E or Tex-406-A'!F102","v":0},{"$f":"IF(B16=\"\",\"\",100-B16)","v":100}]
[{"$f":"IF(ISERROR(INDEX(INDIRECT(\"grade\"&Grade),4,2)),\"\",INDEX(INDIRECT(\"grade\"&Grade),4,2))","v":""},{"$f":"'Tex-106-E or Tex-406-A'!F103","v":0},{"$f":"IF(B17=\"\",\"\",100-B17)","v":100}]
[{"$f":"IF(ISERROR(INDEX(INDIRECT(\"grade\"&Grade),5,2)),\"\",INDEX(INDIRECT(\"grade\"&Grade),5,2))","v":""},{"$f":"'Tex-106-E or Tex-406-A'!E104","v":"Authorized Date:"},{"$f":"IF(B18=\"\",\"\",100-B18)","v":{"$error":"#VALUE!"}}]