{"text_format":"1","workbook":"xlsx","n_sheets":4,"sheets":["Tex-501-C","tests","RX","Revisions"],"not_rendered":{"charts":0,"images":1,"macros":1,"external_links":0,"defined_names":453,"comments":1,"pivot_tables":1},"unopened":[],"bounds":{"document_bytes":16777216,"sheet_cells":100000,"rows_first":2000,"rows_last":500,"rows_between":2000,"halvings":0,"cell_chars":16384,"cell_head_chars":4096},"cells_cut":0,"cells_raw":0,"read":"whole","date_system":"1900"}

{"sheet":"Tex-501-C","index":0,"n_rows":420,"n_cols":12,"rows_kept":420,"cut":false,"hidden":false,"merged":[[0,0,0,1],[13,7,13,8],[130,6,131,6],[9,7,9,8],[13,3,13,4],[7,3,7,4],[7,7,7,8],[8,3,8,4],[8,7,8,8],[117,5,118,5],[9,3,9,4],[11,7,11,8],[15,3,15,8],[16,3,16,4],[56,2,56,3],[12,3,12,4],[414,1,414,3],[16,7,16,8],[300,6,301,6],[300,5,301,5],[408,2,408,4],[177,3,178,3],[50,1,50,3],[74,1,74,3],[315,5,316,5],[286,5,287,5],[234,2,234,4],[32,3,32,4],[54,1,54,3],[51,1,51,3],[53,1,53,3],[117,4,118,4],[10,7,10,8],[10,3,10,4],[14,3,14,8],[11,3,11,4],[55,2,55,3],[12,7,12,8],[117,6,118,6],[238,2,238,4],[79,2,79,4],[177,4,178,4],[99,2,99,4],[109,3,109,4],[236,2,236,4],[235,2,235,4],[147,2,147,4],[233,2,233,4],[130,4,131,4],[130,5,131,5],[155,2,155,4],[410,6,410,8],[300,4,301,4],[407,2,407,4],[398,1,398,8],[315,4,316,4],[324,3,324,4],[352,2,352,4],[315,6,316,6],[401,2,401,4],[402,2,402,4],[399,1,399,8],[403,2,403,4],[404,2,404,4],[405,2,405,4],[410,1,410,3],[253,4,253,5],[237,2,237,4],[396,1,397,8],[364,2,364,4],[358,2,358,4],[253,6,253,7],[286,4,287,4],[286,6,287,6],[332,3,332,4]]}
["TxDOT Manuals >",null,null,"Tex-501-C"]
[null,"TEXAS DEPARTMENT OF TRANSPORTATION",null,null,null,null,null,null,null,null,212]
[null,null,null,null,null,null,null,null,null,null,1]
[null,null,null,null,null,null,null,null,null,null,"txtras.xlsm::45568.683993"]
[null,"TESTS PROPERTIES OF ASPHALTIC MATERIALS"]
[null,"Tex-501-C"]
[null,null,null,null,null,null,null,null,{"$f":"\"TXTRAS - File Version: \" & TEXT(MID(sn,SEARCH(\"::\",sn,1)+2,20),\"mm/dd/yy hh:mm:ss\")","v":"TXTRAS - File Version: 10/03/24 16:24:57"}]
[null,null,"SAMPLE ID:",null,null,null,"SAMPLED DATE:"]
[null,null,"TEST NUMBER:",null,null,null,"LETTING DATE:"]
[null,null,"SAMPLE STATUS:",null,null,null,"CONTROLLING CSJ:"]
[null,null,"COUNTY:",null,null,null,"SPEC YEAR:"]
[null,null,"SAMPLED BY:",null,null,null,"SPEC ITEM:"]
[null,null,"SAMPLE LOCATION:",null,null,null,"SPECIAL PROVISION:"]
[null,null,"MATERIAL CODE:",null,null,null,"GRADE:"]
[null,null,"MATERIAL NAME:"]
[null,null,"PRODUCER:"]
[null,null,"AREA ENGINEER:",null,null,null,"PROJECT MANAGER:"]
[]
[null,null,"COURSE\\LIFT:",null,"STATION:",null,null,"DIST. FROM CL:"]
[]
[null,"Tex 502-C : Penetration of Bituminous Materials"]
[]
[null,null,null,null,{"$f":"\"Penetration at \"&+F25&\"ºF, dmm\"","v":"Penetration at ºF, dmm"}]
[]
[null,null,null,null,"Temperature, ºF"]
[]
[null,"Tex 503-C : Ductility of Bituminous Materials"]
[]
[null,null,null,null,{"$f":"\"Ductility at \" & +F31 & \"ºF, cm\"","v":"Ductility at ºF, cm"}]
[]
[null,null,null,null,"Temperature, ºF"]
[]
[null,null,null,"Travel Speed, cm/min"]
[]
[null,"Tex 504-C : Flash and Fire Points by Cleveland Open Cup"]
[]
[null,null,null,null,"Flash Point by C.O.C., ºF"]
[]
[null,"Tex 505-C : Softening Point of Bitumen (Ring and Ball Apparatus)"]
[]
[null,null,null,null,"Softening Point, ºF"]
[]
[null,null,null,null,"Bath Medium"]
[]
[null,"Tex 506-C : Loss/Gain on Heating of Oil and Asphaltic Compounds"]
[]
[null,null,null,{"$f":"IF(G58=\"\",\"\",IF(G58<0,\"Loss On Heating, %\",\"Gain on Heating, %\"))","v":""},{"$f":"IF((G58=\"\"),\"\",ABS(G58*100))","v":""}]
[]
[null,null,null,null,"A","B","C"]
[null,null,null,"Weight of Bottle/Pan, g"]
[null,"Original:"]
[null,"Weight of Bottle/Pan and Sample, g"]
[null,null,null,"Weight of Sample, g",{"$f":"IF(COUNTBLANK(E50:E52)=3,\"\",E52-E50)","v":""},{"$f":"IF(COUNTBLANK(F50:F52)=3,\"\",F52-F50)","v":""},{"$f":"IF(COUNTBLANK(G50:G52)=3,\"\",G52-G50)","v":""}]
[null,"Aged:"]
[null,"Weight of Bottle/Pan and Residue, g"]
[null,null,"Weight of Residue, g",null,{"$f":"IF(AND(E55=\"\",E50=\"\"),\"\",E55-E50)","v":""},{"$f":"IF(AND(F55=\"\",F50=\"\"),\"\",F55-F50)","v":""},{"$f":"IF(AND(G55=\"\",G50=\"\"),\"\",G55-G50)","v":""}]
[null,null,"Percent Loss/Gain, %:",null,{"$f":"IF(ISERROR((+E56-E53)/E53),\"\",(+E56-E53)/E53)","v":""},{"$f":"IF(ISERROR((+F56-F53)/F53),\"\",(+F56-F53)/F53)","v":""},{"$f":"IF(ISERROR((+G56-G53)/G53),\"\",(+G56-G53)/G53)","v":""}]
[null,null,null,null,null,"Average",{"$f":"IF(ISERROR(AVERAGE(E57:G57)),\"\",AVERAGE(E57:G57))","v":""}]
[]
[null,"Tex 507-C : Solubility of Bituminous Materials"]
[]
[null,null,null,"Percent Soluble, %",{"$f":"IF(E64=\"\",\"\",100-E64)","v":""}]
[]
[null,null,null,"Percent Insoluble, %",{"$f":"IF(G76=\"\",\"\",(G76)*100)","v":""}]
[]
[null,null,null,null,"A","B","C"]
[null,null,null,"Weight of Crucible and Filter, g"]
[null,null,null,"Weight of Flask, g"]
[]
[null,null,null,"Weight of Flask and Sample, g"]
[null,null,null,"Weight of Sample, g",{"$f":"IF(COUNTBLANK(E68:E70)=3,\"\",E70-E68)","v":""},{"$f":"IF(COUNTBLANK(F68:F70)=3,\"\",F70-F68)","v":""},{"$f":"IF(COUNTBLANK(G68:G70)=3,\"\",G70-G68)","v":""}]
[]
[null,null,null,"Weight of Crucible, Filter & Sample, g"]
[null,null,null,"Sample Retained on Filter, g",{"$f":"IF(AND(E73=\"\",E67=\"\"),\"\",E73-E67)","v":""},{"$f":"IF(AND(F73=\"\",F67=\"\"),\"\",F73-F67)","v":""},{"$f":"IF(AND(G73=\"\",G67=\"\"),\"\",G73-G67)","v":""}]
[null,"Percent of sample retained on Filter, %:",null,null,{"$f":"IF(ISERROR(+E74/E71),\"\",+E74/E71)","v":""},{"$f":"IF(ISERROR(+F74/F71),\"\",+F74/F71)","v":""},{"$f":"IF(ISERROR(+G74/G71),\"\",+G74/G71)","v":""}]
[null,null,null,null,null,"Average",{"$f":"IF(ISERROR(AVERAGE(E75:G75)),\"\",AVERAGE(E75:G75))","v":""}]
[]
[null,"Tex 508-C : Specific Gravity and Density of Semi-Solid Bituminous Materials"]
[]
[null,null,"Specif Gravity at 60º Fahrenheit",null,null,{"$f":"IF(ISERROR(+H80+0.006),\"\",+H80+0.006)","v":""}," 77º Fahrenheit",{"$f":"+F94","v":""}]
[]
[null,null,null,null,"Pycnometer Number"]
[]
[null,null,null,null,"Weight of Pycnometer & Sample, g"]
[null,null,null,null,"Calibrated Weight of Pycnometer, g"]
[null,null,null,null,"Weight of Sample, g",{"$f":"IF(COUNTBLANK(F84:F85)=2,\"\",F84-F85)","v":""}]
[]
[null,null,null,null,"Weight of Pyc,Sample & Water, g"]
[null,null,null,null,"Weight of Pycnometer & Sample, g",{"$f":"IF(F84=\"\",\"\",F84)","v":""}]
[null,null,null,null,"Calibrated Weight of Water, g"]
[null,null,null,null,"Weight of Water, g",{"$f":"IF(ISERROR(F88-F89),\"\",F88-F89)","v":""}]
[null,null,null,null,"Water Displaced by Sample, g",{"$f":"IF(ISERROR(F90-F91),\"\",F90-F91)","v":""}]
[]
[null,null,null,null,"Specific Gravity",{"$f":"IF(ISERROR((+F86)/(F92)),\"\",(+F86)/(F92))","v":""}]
[]
[null,"Tex 510-C :  Thin-Film Oven Test (Tests on Residue)"]
[]
[null,"Tex 502-C : Penetration of Bituminous Materials"]
[]
[null,null,{"$f":"\"Penetration at \"&+F102&\"º F, dmm \"","v":"Penetration at º F, dmm "}]
[]
[null,null,null,null,"Temperature, ºF"]
[]
[null,"Tex 503-C : Ductility of Bituminous Materials"]
[]
[null,null,null,null,{"$f":"\"Ductility at \" & +F108 & \"ºF, cm\"","v":"Ductility at ºF, cm"}]
[]
[null,null,null,null,"Temperature, ºF"]
[]
[null,null,null,"Travel Speed, cm/min"]
[]
[null,"Tex 528-C : Viscosity by Vacuum Capillary Viscometer"]
[null,null,null,null,"Viscosity at 140º Fahrenheit, poise",{"$f":"IF(G123=\"\",\"\",G123)","v":""}]
[]
[null,null,null,null,"Tube Number"]
[null,null,null,null,"Size"]
[]
[null,null,null,null,"Time, seconds","Viscosity Constant","Viscosity, poise"]
[]
[null,null,null,null,null,null,{"$f":"IF(COUNTBLANK(E120:F120)=2,\"\",F120*E120)","v":""}]
[null,null,null,null,null,null,{"$f":"IF(COUNTBLANK(E121:F121)=2,\"\",F121*E121)","v":""}]
[]
[null,null,null,null,null,"Average",{"$f":"IF(E121=0,G120,IF(E120=0,G121,(G120+G121)/2))","v":""}]
[]
[null,"Tex 528-C : Viscosity by Vacuum Capillary Viscometer"]
[null,null,null,null,"Viscosity at 275º Fahrenheit, poise",{"$f":"+G136","v":""}]
[]
[null,null,null,null,"Tube Number"]
[null,null,null,null,"Size"]
[]
[null,null,null,null,"Time, seconds","Viscosity Constant","Viscosity, poise"]
[]
[null,null,null,null,null,null,{"$f":"IF(COUNTBLANK(E133:F133)=2,\"\",F133*E133)","v":""}]
[null,null,null,null,null,null,{"$f":"IF(COUNTBLANK(E134:F134)=2,\"\",F134*E134)","v":""}]
[]
[null,null,null,null,null,"Average",{"$f":"IF(E134=0,G133,IF(E133=0,G134,(G133+G134)/2))","v":""}]
[]
[null,"Tex 512-C : Flash Point with Tag Open-Cup Appartus"]
[]
[null,null,null,null,"Flash Point by Tag Open Cup, ºF"]
[]
[null,"Tex 513-C : Saybolt Viscosity"]
[]
[null,null,null,null,{"$f":"\"Saybolt Viscosity at \"&F146&\"ºF, (Saybolt Seconds)\"","v":"Saybolt Viscosity at ºF, (Saybolt Seconds)"},{"$f":"IF(COUNTBLANK(F146:F148)=3,\"\",F148*F147)","v":""}]
[]
[null,null,null,null,"Temperature, °F"]
[null,null,null,null,"Correction Factor"]
[null,null,"Observed Time, Saybolt Seconds"]
[]
[null,"Tex 514-C : API Gravity of Liquid Asphalts by Hydrometer Method"]
[]
[null,null,null,null,null,"SPECIFIC GRAVITY AT 60°F:",{"$f":"IF(ISERROR(141.5/(F156+131.5)),\"\",141.5/(F156+131.5))","v":""}]
[]
[null,null,null,null,"Actual Temperature.:"]
[null,null,null,null,"Observed API Reading"]
[null,null,"API Gravity at 60°F , (Saybolt Seconds):",null,null,{"$f":"IF(COUNTBLANK(F154:F155)=2,\"\",(2.4958+1.0478*F155)-(0.040649+0.00079678*F155)*F154-0.05678)","v":""}]
[]
[null,"Tex 514-C : Weight per Gallon of Emulsified Asphalt"]
[]
[null,null,null,null,null,"SPECIFIC GRAVITY AT 60°F:",{"$f":"Gravity","v":""}]
[]
[null,null,null,null,"Gallon Cup Number :"]
[]
[null,null,null,null,"Weight of Sample and Gallon Cup, g:"]
[null,null,null,null,"Weight of Gallon Cup, g:"]
[null,null,null,null,"Sample Weight, g:",{"$f":"IF(COUNTBLANK(F164:F165)=2,\"\",F164-F165)","v":""}]
[null,null,null,null,"Conversion to 60º Fahrenheit, Lbs/Gallon:",{"$f":"IF(ISERROR(SampleWeight/10*1.00475),\"\",SampleWeight/10*1.00475)","v":""}]
[null,null,null,null,"Lbs/Gallon of Water",{"$f":"IF(COUNTBLANK(F164:F165)=2,\"\",8.33)","v":""}]
[]
[null,null,null,null,"Specific Gravity at 60º Fahrenheit",{"$f":"IF(ISERROR(Conversion60/WaterWeight),\"\",Conversion60/WaterWeight)","v":""}]
[]
[null,"Tex-515-C : Distillation of Cutback Asphaltic (Bituminous) Products"]
[]
[null,null,null,null,"ASPHALT RESIDUE, %, BY WEIGHT:",{"$f":"F192","v":""},"BY VOL.:",{"$f":"IF(ISERROR(1-G186),\"\",1-G186)","v":""}]
[]
[null,null,null,"INITIAL BOILING POINT, °F:"]
[]
[null,null,null,"Temperature","Distillate Volume (in ml)","% by Volume","% by Volume"]
[null,null,null,null,null,"Total Distillate","Total CB"]
[null,null,null,"320°F",null,{"$f":"IF(ISERROR(+E180/$E$186),\"\",+E180/$E$186)","v":""},{"$f":"IF(ISERROR(E180/$F$198),\"\",E180/$F$198)","v":""}]
[null,null,null,"347°F",null,"",""]
[null,null,null,"374°F",null,"",""]
[null,null,null,"437°F",null,"",""]
[null,null,null,"500°F",null,"",""]
[null,null,null,"600°F",null,"",""]
[null,null,null,"680°F",null,"",""]
[]
[null,null,null,null,"Distillate, Gross, g:"]
[null,null,null,null,"Tare, g:"]
[null,null,null,null,"Distillate, Net, g:",{"$f":"IF(COUNTBLANK(F188:F189)=2,\"\",F188-F189)","v":""}]
[null,null,null,null,"Charge, g:"]
[null,null,null,null,"Res. by Weight, g:",{"$f":"IF(ISERROR(1-F190/F191),\"\",1-F190/F191)","v":""}]
[]
[null,null,null,null,"Cut-Back Specific Gravity:"]
[null,null,null,null,"Intended Sample Volume, ml:",{"$f":"IF(Field77=\"\",\"\",200)","v":""}]
[null,null,null,null,"Ideal sample weight, g:",{"$f":"IF(ISERROR(F195*F194),\"\",F195*F194)","v":""}]
[null,null,null,null,"Actual sample weight, g:",{"$f":"IF(F191=\"\",\"\",F191)","v":""}]
[null,null,null,null,"Actual sample volume, ml:",{"$f":"IF(ISERROR(F197/F194),\"\",F197/F194)","v":""}]
[]
[null,"Tex-519-C : Float Test for Bituminous Materials"]
[]
[null,null,null,null,{"$f":"\"Float at \"  & F204 & \"º \"& E204 & \", seconds\"","v":"Float at º , seconds"}]
[]
[null,null,null,"Temperature"]
[]
[null,"Tex-520-C : Residue of Specified Penetration"]
[]
[null,null,null,null,null,"Interpolation Between Percentages of the Two Residues, g:",{"$f":"IF(ISERROR(F212-((F213-F210)/((F213-F217)/(F212-F216)))),\"\",F212-((F213-F210)/((F213-F217)/(F212-F216))))","v":""}]
[]
[null,null,null,null,"Target Penetration, dmm:"]
[]
[null,null,null,null,"First, Weight of Residue, g:"]
[null,null,null,null,{"$f":"\"Penetration at \"&+F214&\"ºF, dmm:\"","v":"Penetration at ºF, dmm:"}]
[null,null,null,null,"Temperature, °F"]
[]
[null,null,null,null,"Second, Weight of Residue, g:"]
[null,null,null,null,{"$f":"\"Penetration at \"&+F218&\"ºF, dmm:\"","v":"Penetration at ºF, dmm:"}]
[null,null,null,null,"Temperature, °F"]
[]
[null,"Tex-521-C : Testing Emulsified Asphalts"]
[]
[null,null,null,"Distillation:",null,null,"Percent Residue After Distillation, %:",{"$f":"IF(ISERROR(+G230*100),\"\",+G230*100)","v":""}]
[]
[null,null,null,null,null,"Weight of Cold Still & Thermometer, g:"]
[null,null,null,null,null,"Weight of Sample (charge), g:"]
[]
[null,null,null,null,null,"Weight of Residue, Still & Thermometer, g:"]
[null,null,null,null,null,"+ 1.5g Adjustment for Still Weight at 500º F, g:",{"$f":"IF(G227=\"\",\"\",G227+1.5)","v":""}]
[]
[null,null,null,null,null,"Residue After Distillation, g:",{"$f":"IF(ISERROR(+(G228-G224)/G225),\"\",(G228-G224)/G225)","v":""}]
[]
[null,null,null,"Evaporation",null,null,"Percent Residue After Evaporation, %:",{"$f":"IF(ISERROR(ABS(H242*100)),\"\",ABS(H242*100))","v":""}]
[]
[null,null,"Original:",null,null,"A","B","C"]
[null,null,"Weight of Beaker & Rod, g:"]
[null,null,"Weight of Sample (charge), g:"]
[null,null,"After Evaporation:"]
[null,null,"Weight of Beaker, Rod & Residue, g:"]
[null,null,"Weight of Residue, g:",null,null,{"$f":"IF(COUNTBLANK(F235:F238)=4,\"\",F238-F235)","v":""},{"$f":"IF(COUNTBLANK(G235:G238)=4,\"\",G238-G235)","v":""},{"$f":"IF(COUNTBLANK(H235:H238)=4,\"\",H238-H235)","v":""}]
[null,null,null,null,null,{"$f":"IF(ISERROR(+(F239/F236)),\"\",(F239/F236))","v":""},{"$f":"IF(ISERROR(+(G239/G236)),\"\",(G239/G236))","v":""},{"$f":"IF(ISERROR(+(H239/H236)),\"\",(H239/H236))","v":""}]
[]
[null,null,null,null,null,null,"Average",{"$f":"IF(ISERROR(AVERAGE(F240:H240)),\"\",AVERAGE(F240:H240))","v":""}]
[]
[null,null,null,"Demulsibility:",null,"Percent Demulsibility, %:",{"$f":"IF(ISERROR(+G249/G250*100),\"\",+G249/G250*100)","v":""}]
[]
[null,null,null,null,null,"Weight of Beaker,Cloth & Rod, g:"]
[null,null,null,null,null,"Weight of Sample, g:"]
[null,null,null,null,null,"Weight of Sample,Beaker,Cloth & Rod (after drying), g:"]
[null,null,null,null,null,"Percent of Orginal Sample Retained, %:",{"$f":"IF(ISERROR(+(G248-G246)/(G247/100)),\"\",(G248-G246)/(G247/100))","v":""}]
[null,null,null,null,null,"% Residue from Distillation, %:",{"$f":"+DistillationResidue","v":""}]
[]
[null,null,null,"Settlement:",null,"Settlement After 5 Days, %:",{"$f":"IF(ISERROR(+H264-F264),\"\",+H264-F264)","v":""}]
[]
[null,null,"Evaporation for Settlement:",null,"Top",null,"Bottom"]
[]
[null,null,null,"Weight of Beaker & Rod, g:"]
[null,null,null,"Weight of Sample (charge), g:"]
[]
[null,null,null,"Weight of Beaker, Rod & Residue, g:"]
[null,null,null,"Weight of Residue, g:",{"$f":"IF(COUNTBLANK(E256:E259)=4,\"\",E259-E256)","v":""},{"$f":"IF(COUNTBLANK(F256:F259)=4,\"\",F259-F256)","v":""},{"$f":"IF(COUNTBLANK(G256:G259)=4,\"\",G259-G256)","v":""},{"$f":"IF(COUNTBLANK(H256:H259)=4,\"\",H259-H256)","v":""}]
[]
[null,null,null,"% Residue",{"$f":"IF(ISERROR(+(E260/E257*100)),\"\",(E260/E257*100))","v":""},{"$f":"IF(ISERROR(+(F260/F257*100)),\"\",(F260/F257*100))","v":""},{"$f":"IF(ISERROR(+(G260/G257*100)),\"\",(G260/G257*100))","v":""},{"$f":"IF(ISERROR(+(H260/H257*100)),\"\",(H260/H257*100))","v":""}]
[]
[null,null,null,null,"Average % Residue",{"$f":"IF(ISERROR(AVERAGE(+E262,F262)),\"\",AVERAGE(+E262,F262))","v":""},"%",{"$f":"IF(ISERROR(AVERAGE(+G262,H262)),\"\",AVERAGE(+G262,H262))","v":""}]
[]
[null,null,null,"Cement Mix:",null,"Percentage of Break",{"$f":"IF(COUNTBLANK(G271:G272)=2,\"\",G272-G271)","v":""}]
[]
[null,null,null,null,null,"% Residue from Distillation ",{"$f":"+DistillationResidue","v":""}]
[null,null,null,null,null,"Use to Dilute to 55% Residue, ml",{"$f":"IF(ISERROR(5500/G268),\"\",5500/G268)","v":""}]
[]
[null,null,null,null,null,"Weight of # 14 Sieve & Pan, g:"]
[null,null,null,null,null,"Weight of # 14 Sieve, Pan & Residue, g:"]
[]
[null,null,null,"Seive Test:",null,null,"Percentage of Sample Retained, %:",{"$f":"IF(COUNTBLANK(H276:H277)=2,\"\",(H277-H276)/10)","v":""}]
[]
[null,null,null,null,null,null,"Weight of # 20 Sieve & Pan, g:"]
[null,null,null,null,null,null,"Weight of # 20 Sieve, Pan & Residue, g:"]
[]
[]
[null,"Tex 528-C : Viscosity by Vacuum Capillary Viscometer"]
[]
[null,null,null,null,"Viscosity at 140º Fahrenheit, poise:",{"$f":"+G292","v":""}]
[]
[null,null,null,null,"Tube Number"]
[null,null,null,null,"Size"]
[]
[null,null,null,null,"Time, seconds","Viscosity Constant","Viscosity, poise"]
[]
[null,null,null,null,null,null,{"$f":"IF(COUNTBLANK(E289:F289)=2,\"\",F289*E289)","v":""}]
[null,null,null,null,null,null,{"$f":"IF(COUNTBLANK(E290:F290)=2,\"\",F290*E290)","v":""}]
[]
[null,null,null,null,null,"Average",{"$f":"IF(E290=0,G289,IF(E289=0,G290,(G289+G290)/2))","v":""}]
[]
[null,"Tex 528-C : Viscosity by Vacuum Capillary Viscometer"]
[]
[null,null,null,null,"Viscosity at 275º Fahrenheit, poise:",{"$f":"+G306","v":""}]
[]
[null,null,null,null,"Tube Number"]
[null,null,null,null,"Size"]
[]
[null,null,null,null,"Time, seconds","Viscosity Constant","Viscosity, poise"]
[]
[null,null,null,null,null,null,{"$f":"IF(COUNTBLANK(E303:F303)=2,\"\",F303*E303)","v":""}]
[null,null,null,null,null,null,{"$f":"IF(COUNTBLANK(E304:F304)=2,\"\",F304*E304)","v":""}]
[]
[null,null,null,null,null,"Average",{"$f":"IF(E304=0,G303,IF(E303=0,G304,(G303+G304)/2))","v":""}]
[]
[null,"Tex 529-C : Kinematic Viscosity of Asphalts (Bitumens) "]
[]
[null,null,null,null,null,"KINEMATIC VISCOSITY AT 140°F, cSt:",{"$f":"G321","v":""}]
[]
[null,null,null,null,"Tube Number:"]
[]
[null,null,null,null,"Tube Size:"]
[]
[null,null,null,null,"Time, seconds","Viscosity Constant","Viscosity, cSt"]
[]
[null,null,null,null,null,null,{"$f":"IF(COUNTBLANK(E318:F318)=2,\"\",F318*E318)","v":""}]
[null,null,null,null,null,null,{"$f":"IF(COUNTBLANK(E319:F319)=2,\"\",F319*E319)","v":""}]
[]
[null,null,null,null,null,"Average",{"$f":"IF(E319=0,G318,IF(E318=0,G319,(G318+G319)/2))","v":""}]
[]
[null,"Tex 539-C : Elastic Recovery of Bituminous Materials"]
[]
[null,null,null,{"$f":"\"Recovery at \" & +F331 & \"ºF, %:\"","v":"Recovery at ºF, %:"},null,{"$f":"IF(ISERROR((F329-F327)/F329*100),\"\",(F329-F327)/F329*100)","v":""}]
[]
[null,null,null,null,"Length of Cut Sample After (1) Hour, cm:"]
[]
[null,null,null,null,"Distance of Pull (Before Cut), cm:"]
[]
[null,null,null,null,"Temperature, °F:"]
[]
[null,null,null,"Travel Speed, cm/min."]
[]
[null,"Tex 540-C : Measurement of Polymer Separation on Heating in Modified Asphalt Systems"]
[]
[null,null,null,null,null,"Polymer Separation After Heating"]
[null,"*OPTIONAL"]
[null,null,null,null,null,null,"Difference in Top and Bottom Softening Points as a Percentage of the Largest Value.",{"$f":"IF(ISERROR(IF(+F343>F345,(+F343-F345)/F343,(+F345-F343)/F345)*100),\"\",IF(+F343>F345,(+F343-F345)/F343,(+F345-F343)/F345)*100)","v":""}]
[]
[null,"Tex 505-C : Softening Point of Bitumen (Ring and Ball Apparatus)"]
[]
[null,null,null,null,"TOP, Softening Point, °F:"]
[]
[null,null,null,null,"BOTTOM, Softening Point, °F:"]
[]
[null,null,null,null,"Bath Medium"]
[]
[null,null,"Performance Grade"]
[]
[null,"AASHTO TP5 : Dynamic Shear Rheometer"]
[]
[null,null,"Dynamic Shear Rheometer, G*/sin(delta) kPa:"]
[null,null,null,null,"Test Temperature, °C:",{"$f":"LEFT(PerformanceGrade,2)","v":""}]
[]
[null,"AASHTO T240 : Rolling Thin Film Oven (Tests on Residue)"]
[]
[null,"AASHTO TP5 : Dynamic Shear Rheometer"]
[null,null,"Dynamic Shear Rheometer, G*/sin(delta) kPa:"]
[null,null,null,null," Test Temperature, °C:",{"$f":"LEFT(PerformanceGrade,2)","v":""}]
[]
[null,"AASHTO PP1 : Pressure Aged Vessel Test (Tests on Residue)"]
[]
[null,"AASHTO TP5 : Dynamic Shear Rheometer"]
[null,null,"Dynamic Shear Rheometer, G*sin(delta) Mpa:"]
[null,null,null,null," Test Temperature, °C:",{"$f":"IF(ISERROR((LEFT(PerformanceGrade,2)-46)/2+22-((MID(PerformanceGrade,4,2)-10)/2)),\"\",(LEFT(PerformanceGrade,2)-46)/2+22-((MID(PerformanceGrade,4,2)-10)/2))","v":""}]
[]
[null,"AASHTO TP1 : Bending Beam Rheometer"]
[null,null,null,null,"Creep Stiffness, Mpa:"]
[null,null,null,null,"M - Value"]
[null,null,null,null,"Test Temperature, °C:",{"$f":"IF(ISERROR(\"-\"&MID(PerformanceGrade:PerformanceGrade,4,2)-10),\"\",\"-\"&MID(PerformanceGrade:PerformanceGrade,4,2)-10)","v":""}]
[]
[null,"AASHTO TP3 : Direct Tension Rheometer"]
[null,null,null,null,"Direst Tension"]
[null,null,null,null,"Test Temperature, °C:",{"$f":"IF(ISERROR(\"-\" & MID(PerformanceGrade:PerformanceGrade,4,2)-10),\"\",\"-\" & MID(PerformanceGrade:PerformanceGrade,4,2)-10)","v":""}]
[]
[null,"AASHTO TP48 : Rotational Viscosity (Brookfield)(275ºF/135ºC)"]
[null,null,null,null,null,{"$f":"\"Rotational Viscosity at \" &+G382&\" °C, Mpa:\"","v":"Rotational Viscosity at  °C, Mpa:"},{"$f":"IF(ISERROR(AVERAGE(E381:G381)),\"\",AVERAGE(E381:G381))","v":""}]
[]
[null,null,null,null,"1, minute","2, minutes","3, minutes"]
[null,null,null,"Viscosity, Mpa:"]
[null,null,null,null,null,"Test Temperature, °C:"]
[null,null,null,null,null,"Speed"]
[null,null,null,null,null,"Spindel Number"]
[]
[null,"AASHTO TP48 : Rotational Viscosity (Brookfield)(325ºF/163ºC)"]
[null,null,null,null,null,{"$f":"\"Rotational Viscosity at \" &+G391&\"°C, Mpa:\"","v":"Rotational Viscosity at °C, Mpa:"},{"$f":"IF(ISERROR(AVERAGE(E390:G390)),\"\",AVERAGE(E390:G390))","v":""}]
[]
[null,null,null,null,"1, minute","2, minutes","3, minutes"]
[null,null,null,"Viscosity, Mpa:"]
[null,null,null,null,null,"Test Temperature, °C:"]
[null,null,null,null,null,"Speed"]
[null,null,null,null,null,"Spindel Number"]
[]
[]
[null,"Remarks:",{"$f":"NOW()","v":"2024-10-03T16:24:57.200"}]
[]
[]
[]
[]
[]
[null,"Sample Method:","Sampled By:",null,null,"Sampled Date:"]
[null,"TX500PI"]
[null,"TX500PII"]
[null,"TX500PIII"]
[null,"TX500PIX"]
[]
[null,"Test Method:","Tested By:",null,null,"Tested Date:"]
[null,"TXTRAS"]
[null,"Test Stamp Code:",null,null,"Omit Test:","Completed Date:","Reviewed By:"]
[]
[null,"Locked By:","TxDOT:","District:","Area:"]
[null,"","","",""]
[null,"Authorized By:",null,null,"Authorized Date:"]
[]
[null,null,null,null,null,{"$f":"NOW()","v":"2024-10-03T16:24:57.200"}]
[null,{"$f":"\"LIMS TEST DATA RESULTS\" & IF(linkedTo<> \"\",\" FROM LINKED SAMPLE '\" & linkedTo & \"'\",\"\" )","v":"LIMS TEST DATA RESULTS"}]
[]
[null,"LIMS"]
[null,"SiteManager Test Nbr","LIMS id","TEST","TEST NAME","DESCRIPTION","RESULTS","MIN","MAX","UNIT","PASSED","Total"]

{"sheet":"tests","index":1,"n_rows":2,"n_cols":8,"rows_kept":2,"cut":false,"hidden":true,"merged":[[1,2,1,5],[11,2,11,5],[12,2,12,5],[10,2,10,5],[2,2,2,5],[3,2,3,5],[28,2,28,5],[29,2,29,5],[30,2,30,5],[4,2,4,5],[19,2,19,5],[20,2,20,5],[21,2,21,5],[22,2,22,5],[16,2,16,5],[17,2,17,5],[18,2,18,5],[9,2,9,5],[13,2,13,5],[14,2,14,5],[15,2,15,5],[35,2,35,5],[36,2,36,5],[37,2,37,5],[5,2,5,5],[6,2,6,5],[7,2,7,5],[8,2,8,5],[31,2,31,5],[32,2,32,5],[34,2,34,5],[23,2,23,5],[24,2,24,5],[33,2,33,5],[25,2,25,5],[26,2,26,5],[27,2,27,5]]}
[null,null,null,null,null,null,null,"Linked To:"]
[null,null,"Test methods shown on this report for:"]

{"sheet":"RX","index":2,"n_rows":290,"n_cols":9,"rows_kept":290,"cut":false,"hidden":true,"merged":[]}
[288]
["Fld_nbr","Value","Desc_1","Desc_2","Desc_3","Desc_4","Desc_5","Desc_6","Desc_7"]
[1,{"$f":"IF('Tex-501-C'!$B$397=\"\",\"\",'Tex-501-C'!$B$397)","v":""},{"$f":"'Tex-501-C'!$B$396","v":"Remarks:"}]
[2,{"$f":"IF('Tex-501-C'!$D$19=\"\",\"\",'Tex-501-C'!$D$19)","v":""},{"$f":"IF('Tex-501-C'!$C$19=\"\",\"\",'Tex-501-C'!$C$19)","v":"COURSE\\LIFT:"}]
[3,{"$f":"IF('Tex-501-C'!$C$409=\"\",\"\",'Tex-501-C'!$C$409)","v":""},"Tested By ",{"$f":"IF('Tex-501-C'!$B$409=\"\",\"\",'Tex-501-C'!$B$409)","v":"TXTRAS"}]
[4,{"$f":"IF('Tex-501-C'!$F$409=\"\",\"\",'Tex-501-C'!$F$409)","v":""},"Tested Date ",{"$f":"IF('Tex-501-C'!$B$409=\"\",\"\",'Tex-501-C'!$B$409)","v":"TXTRAS"}]
[5,{"$f":"IF('Tex-501-C'!$F$23=\"\",\"\",'Tex-501-C'!$F$23)","v":""},{"$f":"IF('Tex-501-C'!$B$21=\"\",\"\",'Tex-501-C'!$B$21)","v":"Tex 502-C : Penetration of Bituminous Materials"},{"$f":"IF('Tex-501-C'!$E$23=\"\",\"\",'Tex-501-C'!$E$23)","v":"Penetration at ºF, dmm"}]
[6,{"$f":"IF('Tex-501-C'!$F$25=\"\",\"\",'Tex-501-C'!$F$25)","v":""},{"$f":"IF('Tex-501-C'!$B$21=\"\",\"\",'Tex-501-C'!$B$21)","v":"Tex 502-C : Penetration of Bituminous Materials"},{"$f":"IF('Tex-501-C'!$E$25=\"\",\"\",'Tex-501-C'!$E$25)","v":"Temperature, ºF"}]
[7,{"$f":"IF('Tex-501-C'!$F$29=\"\",\"\",'Tex-501-C'!$F$29)","v":""},{"$f":"IF('Tex-501-C'!$B$27=\"\",\"\",'Tex-501-C'!$B$27)","v":"Tex 503-C : Ductility of Bituminous Materials"},{"$f":"IF('Tex-501-C'!$E$29=\"\",\"\",'Tex-501-C'!$E$29)","v":"Ductility at ºF, cm"}]
[8,{"$f":"IF('Tex-501-C'!$F$31=\"\",\"\",'Tex-501-C'!$F$31)","v":""},{"$f":"IF('Tex-501-C'!$B$27=\"\",\"\",'Tex-501-C'!$B$27)","v":"Tex 503-C : Ductility of Bituminous Materials"},{"$f":"IF('Tex-501-C'!$E$31=\"\",\"\",'Tex-501-C'!$E$31)","v":"Temperature, ºF"}]
[9,{"$f":"IF('Tex-501-C'!$F$33=\"\",\"\",'Tex-501-C'!$F$33)","v":""},{"$f":"IF('Tex-501-C'!$B$27=\"\",\"\",'Tex-501-C'!$B$27)","v":"Tex 503-C : Ductility of Bituminous Materials"},{"$f":"IF('Tex-501-C'!$D$33=\"\",\"\",'Tex-501-C'!$D$33)","v":"Travel Speed, cm/min"}]
[10,{"$f":"IF('Tex-501-C'!$F$37=\"\",\"\",'Tex-501-C'!$F$37)","v":""},{"$f":"IF('Tex-501-C'!$B$35=\"\",\"\",'Tex-501-C'!$B$35)","v":"Tex 504-C : Flash and Fire Points by Cleveland Open Cup"},{"$f":"IF('Tex-501-C'!$E$37=\"\",\"\",'Tex-501-C'!$E$37)","v":"Flash Point by C.O.C., ºF"}]
[11,{"$f":"IF('Tex-501-C'!$F$41=\"\",\"\",'Tex-501-C'!$F$41)","v":""},{"$f":"IF('Tex-501-C'!$B$39=\"\",\"\",'Tex-501-C'!$B$39)","v":"Tex 505-C : Softening Point of Bitumen (Ring and Ball Apparatus)"},{"$f":"IF('Tex-501-C'!$E$41=\"\",\"\",'Tex-501-C'!$E$41)","v":"Softening Point, ºF"}]
[12,{"$f":"IF('Tex-501-C'!$F$43=\"\",\"\",'Tex-501-C'!$F$43)","v":""},{"$f":"IF('Tex-501-C'!$B$39=\"\",\"\",'Tex-501-C'!$B$39)","v":"Tex 505-C : Softening Point of Bitumen (Ring and Ball Apparatus)"},{"$f":"IF('Tex-501-C'!$E$43=\"\",\"\",'Tex-501-C'!$E$43)","v":"Bath Medium"}]
[13,{"$f":"IF('Tex-501-C'!$E$47=\"\",\"\",'Tex-501-C'!$E$47)","v":""},{"$f":"IF('Tex-501-C'!$B$45=\"\",\"\",'Tex-501-C'!$B$45)","v":"Tex 506-C : Loss/Gain on Heating of Oil and Asphaltic Compounds"},{"$f":"IF('Tex-501-C'!$D$47=\"\",\"\",'Tex-501-C'!$D$47)","v":""}]
[14,{"$f":"IF('Tex-501-C'!$E$50=\"\",\"\",'Tex-501-C'!$E$50)","v":""},{"$f":"IF('Tex-501-C'!$B$45=\"\",\"\",'Tex-501-C'!$B$45)","v":"Tex 506-C : Loss/Gain on Heating of Oil and Asphaltic Compounds"},{"$f":"IF('Tex-501-C'!$D$50=\"\",\"\",'Tex-501-C'!$D$50)","v":"Weight of Bottle/Pan, g"},{"$f":"IF('Tex-501-C'!$E$49=\"\",\"\",'Tex-501-C'!$E$49)","v":"A"}]
[15,{"$f":"IF('Tex-501-C'!$F$50=\"\",\"\",'Tex-501-C'!$F$50)","v":""},{"$f":"IF('Tex-501-C'!$B$45=\"\",\"\",'Tex-501-C'!$B$45)","v":"Tex 506-C : Loss/Gain on Heating of Oil and Asphaltic Compounds"},{"$f":"IF('Tex-501-C'!$D$50=\"\",\"\",'Tex-501-C'!$D$50)","v":"Weight of Bottle/Pan, g"},{"$f":"IF('Tex-501-C'!$F$49=\"\",\"\",'Tex-501-C'!$F$49)","v":"B"}]
[16,{"$f":"IF('Tex-501-C'!$G$50=\"\",\"\",'Tex-501-C'!$G$50)","v":""},{"$f":"IF('Tex-501-C'!$B$45=\"\",\"\",'Tex-501-C'!$B$45)","v":"Tex 506-C : Loss/Gain on Heating of Oil and Asphaltic Compounds"},{"$f":"IF('Tex-501-C'!$D$50=\"\",\"\",'Tex-501-C'!$D$50)","v":"Weight of Bottle/Pan, g"},{"$f":"IF('Tex-501-C'!$G$49=\"\",\"\",'Tex-501-C'!$G$49)","v":"C"}]
[17,{"$f":"IF('Tex-501-C'!$E$52=\"\",\"\",'Tex-501-C'!$E$52)","v":""},{"$f":"IF('Tex-501-C'!$B$45=\"\",\"\",'Tex-501-C'!$B$45)","v":"Tex 506-C : Loss/Gain on Heating of Oil and Asphaltic Compounds"},{"$f":"IF('Tex-501-C'!$B$51=\"\",\"\",'Tex-501-C'!$B$51)","v":"Original:"},{"$f":"IF('Tex-501-C'!$B$52=\"\",\"\",'Tex-501-C'!$B$52)","v":"Weight of Bottle/Pan and Sample, g"},{"$f":"IF('Tex-501-C'!$E$49=\"\",\"\",'Tex-501-C'!$E$49)","v":"A"}]
[18,{"$f":"IF('Tex-501-C'!$F$52=\"\",\"\",'Tex-501-C'!$F$52)","v":""},{"$f":"IF('Tex-501-C'!$B$45=\"\",\"\",'Tex-501-C'!$B$45)","v":"Tex 506-C : Loss/Gain on Heating of Oil and Asphaltic Compounds"},{"$f":"IF('Tex-501-C'!$B$51=\"\",\"\",'Tex-501-C'!$B$51)","v":"Original:"},{"$f":"IF('Tex-501-C'!$B$52=\"\",\"\",'Tex-501-C'!$B$52)","v":"Weight of Bottle/Pan and Sample, g"},{"$f":"IF('Tex-501-C'!$F$49=\"\",\"\",'Tex-501-C'!$F$49)","v":"B"}]
[19,{"$f":"IF('Tex-501-C'!$G$52=\"\",\"\",'Tex-501-C'!$G$52)","v":""},{"$f":"IF('Tex-501-C'!$B$45=\"\",\"\",'Tex-501-C'!$B$45)","v":"Tex 506-C : Loss/Gain on Heating of Oil and Asphaltic Compounds"},{"$f":"IF('Tex-501-C'!$B$51=\"\",\"\",'Tex-501-C'!$B$51)","v":"Original:"},{"$f":"IF('Tex-501-C'!$B$52=\"\",\"\",'Tex-501-C'!$B$52)","v":"Weight of Bottle/Pan and Sample, g"},{"$f":"IF('Tex-501-C'!$G$49=\"\",\"\",'Tex-501-C'!$G$49)","v":"C"}]
[20,{"$f":"IF('Tex-501-C'!$E$53=\"\",\"\",'Tex-501-C'!$E$53)","v":""},{"$f":"IF('Tex-501-C'!$B$45=\"\",\"\",'Tex-501-C'!$B$45)","v":"Tex 506-C : Loss/Gain on Heating of Oil and Asphaltic Compounds"},{"$f":"IF('Tex-501-C'!$B$51=\"\",\"\",'Tex-501-C'!$B$51)","v":"Original:"},{"$f":"IF('Tex-501-C'!$D$53=\"\",\"\",'Tex-501-C'!$D$53)","v":"Weight of Sample, g"},{"$f":"IF('Tex-501-C'!$E$49=\"\",\"\",'Tex-501-C'!$E$49)","v":"A"}]
[21,{"$f":"IF('Tex-501-C'!$F$53=\"\",\"\",'Tex-501-C'!$F$53)","v":""},{"$f":"IF('Tex-501-C'!$B$45=\"\",\"\",'Tex-501-C'!$B$45)","v":"Tex 506-C : Loss/Gain on Heating of Oil and Asphaltic Compounds"},{"$f":"IF('Tex-501-C'!$B$51=\"\",\"\",'Tex-501-C'!$B$51)","v":"Original:"},{"$f":"IF('Tex-501-C'!$D$53=\"\",\"\",'Tex-501-C'!$D$53)","v":"Weight of Sample, g"},{"$f":"IF('Tex-501-C'!$F$49=\"\",\"\",'Tex-501-C'!$F$49)","v":"B"}]
[22,{"$f":"IF('Tex-501-C'!$G$53=\"\",\"\",'Tex-501-C'!$G$53)","v":""},{"$f":"IF('Tex-501-C'!$B$45=\"\",\"\",'Tex-501-C'!$B$45)","v":"Tex 506-C : Loss/Gain on Heating of Oil and Asphaltic Compounds"},{"$f":"IF('Tex-501-C'!$B$51=\"\",\"\",'Tex-501-C'!$B$51)","v":"Original:"},{"$f":"IF('Tex-501-C'!$D$53=\"\",\"\",'Tex-501-C'!$D$53)","v":"Weight of Sample, g"},{"$f":"IF('Tex-501-C'!$G$49=\"\",\"\",'Tex-501-C'!$G$49)","v":"C"}]
[23,{"$f":"IF('Tex-501-C'!$E$55=\"\",\"\",'Tex-501-C'!$E$55)","v":""},{"$f":"IF('Tex-501-C'!$B$45=\"\",\"\",'Tex-501-C'!$B$45)","v":"Tex 506-C : Loss/Gain on Heating of Oil and Asphaltic Compounds"},{"$f":"IF('Tex-501-C'!$B$54=\"\",\"\",'Tex-501-C'!$B$54)","v":"Aged:"},{"$f":"IF('Tex-501-C'!$B$55=\"\",\"\",'Tex-501-C'!$B$55)","v":"Weight of Bottle/Pan and Residue, g"},{"$f":"IF('Tex-501-C'!$E$49=\"\",\"\",'Tex-501-C'!$E$49)","v":"A"}]
[24,{"$f":"IF('Tex-501-C'!$F$55=\"\",\"\",'Tex-501-C'!$F$55)","v":""},{"$f":"IF('Tex-501-C'!$B$45=\"\",\"\",'Tex-501-C'!$B$45)","v":"Tex 506-C : Loss/Gain on Heating of Oil and Asphaltic Compounds"},{"$f":"IF('Tex-501-C'!$B$54=\"\",\"\",'Tex-501-C'!$B$54)","v":"Aged:"},{"$f":"IF('Tex-501-C'!$B$55=\"\",\"\",'Tex-501-C'!$B$55)","v":"Weight of Bottle/Pan and Residue, g"},{"$f":"IF('Tex-501-C'!$F$49=\"\",\"\",'Tex-501-C'!$F$49)","v":"B"}]
[25,{"$f":"IF('Tex-501-C'!$G$55=\"\",\"\",'Tex-501-C'!$G$55)","v":""},{"$f":"IF('Tex-501-C'!$B$45=\"\",\"\",'Tex-501-C'!$B$45)","v":"Tex 506-C : Loss/Gain on Heating of Oil and Asphaltic Compounds"},{"$f":"IF('Tex-501-C'!$B$54=\"\",\"\",'Tex-501-C'!$B$54)","v":"Aged:"},{"$f":"IF('Tex-501-C'!$B$55=\"\",\"\",'Tex-501-C'!$B$55)","v":"Weight of Bottle/Pan and Residue, g"},{"$f":"IF('Tex-501-C'!$G$49=\"\",\"\",'Tex-501-C'!$G$49)","v":"C"}]
[26,{"$f":"IF('Tex-501-C'!$E$56=\"\",\"\",'Tex-501-C'!$E$56)","v":""},{"$f":"IF('Tex-501-C'!$B$45=\"\",\"\",'Tex-501-C'!$B$45)","v":"Tex 506-C : Loss/Gain on Heating of Oil and Asphaltic Compounds"},{"$f":"IF('Tex-501-C'!$B$54=\"\",\"\",'Tex-501-C'!$B$54)","v":"Aged:"},{"$f":"IF('Tex-501-C'!$C$56=\"\",\"\",'Tex-501-C'!$C$56)","v":"Weight of Residue, g"},{"$f":"IF('Tex-501-C'!$E$49=\"\",\"\",'Tex-501-C'!$E$49)","v":"A"}]
[27,{"$f":"IF('Tex-501-C'!$F$56=\"\",\"\",'Tex-501-C'!$F$56)","v":""},{"$f":"IF('Tex-501-C'!$B$45=\"\",\"\",'Tex-501-C'!$B$45)","v":"Tex 506-C : Loss/Gain on Heating of Oil and Asphaltic Compounds"},{"$f":"IF('Tex-501-C'!$B$54=\"\",\"\",'Tex-501-C'!$B$54)","v":"Aged:"},{"$f":"IF('Tex-501-C'!$C$56=\"\",\"\",'Tex-501-C'!$C$56)","v":"Weight of Residue, g"},{"$f":"IF('Tex-501-C'!$F$49=\"\",\"\",'Tex-501-C'!$F$49)","v":"B"}]
[28,{"$f":"IF('Tex-501-C'!$G$56=\"\",\"\",'Tex-501-C'!$G$56)","v":""},{"$f":"IF('Tex-501-C'!$B$45=\"\",\"\",'Tex-501-C'!$B$45)","v":"Tex 506-C : Loss/Gain on Heating of Oil and Asphaltic Compounds"},{"$f":"IF('Tex-501-C'!$B$54=\"\",\"\",'Tex-501-C'!$B$54)","v":"Aged:"},{"$f":"IF('Tex-501-C'!$C$56=\"\",\"\",'Tex-501-C'!$C$56)","v":"Weight of Residue, g"},{"$f":"IF('Tex-501-C'!$G$49=\"\",\"\",'Tex-501-C'!$G$49)","v":"C"}]
[29,{"$f":"IF('Tex-501-C'!$E$57=\"\",\"\",'Tex-501-C'!$E$57)","v":""},{"$f":"IF('Tex-501-C'!$B$45=\"\",\"\",'Tex-501-C'!$B$45)","v":"Tex 506-C : Loss/Gain on Heating of Oil and Asphaltic Compounds"},{"$f":"IF('Tex-501-C'!$B$54=\"\",\"\",'Tex-501-C'!$B$54)","v":"Aged:"},{"$f":"IF('Tex-501-C'!$C$57=\"\",\"\",'Tex-501-C'!$C$57)","v":"Percent Loss/Gain, %:"},{"$f":"IF('Tex-501-C'!$E$49=\"\",\"\",'Tex-501-C'!$E$49)","v":"A"}]
[30,{"$f":"IF('Tex-501-C'!$F$57=\"\",\"\",'Tex-501-C'!$F$57)","v":""},{"$f":"IF('Tex-501-C'!$B$45=\"\",\"\",'Tex-501-C'!$B$45)","v":"Tex 506-C : Loss/Gain on Heating of Oil and Asphaltic Compounds"},{"$f":"IF('Tex-501-C'!$B$54=\"\",\"\",'Tex-501-C'!$B$54)","v":"Aged:"},{"$f":"IF('Tex-501-C'!$C$57=\"\",\"\",'Tex-501-C'!$C$57)","v":"Percent Loss/Gain, %:"},{"$f":"IF('Tex-501-C'!$F$49=\"\",\"\",'Tex-501-C'!$F$49)","v":"B"}]
[31,{"$f":"IF('Tex-501-C'!$G$57=\"\",\"\",'Tex-501-C'!$G$57)","v":""},{"$f":"IF('Tex-501-C'!$B$45=\"\",\"\",'Tex-501-C'!$B$45)","v":"Tex 506-C : Loss/Gain on Heating of Oil and Asphaltic Compounds"},{"$f":"IF('Tex-501-C'!$B$54=\"\",\"\",'Tex-501-C'!$B$54)","v":"Aged:"},{"$f":"IF('Tex-501-C'!$C$57=\"\",\"\",'Tex-501-C'!$C$57)","v":"Percent Loss/Gain, %:"},{"$f":"IF('Tex-501-C'!$G$49=\"\",\"\",'Tex-501-C'!$G$49)","v":"C"}]
[32,{"$f":"IF('Tex-501-C'!$G$58=\"\",\"\",'Tex-501-C'!$G$58)","v":""},{"$f":"IF('Tex-501-C'!$B$45=\"\",\"\",'Tex-501-C'!$B$45)","v":"Tex 506-C : Loss/Gain on Heating of Oil and Asphaltic Compounds"},{"$f":"IF('Tex-501-C'!$F$58=\"\",\"\",'Tex-501-C'!$F$58)","v":"Average"}]
[33,{"$f":"IF('Tex-501-C'!$E$62=\"\",\"\",'Tex-501-C'!$E$62)","v":""},{"$f":"IF('Tex-501-C'!$B$60=\"\",\"\",'Tex-501-C'!$B$60)","v":"Tex 507-C : Solubility of Bituminous Materials"},{"$f":"IF('Tex-501-C'!$D$62=\"\",\"\",'Tex-501-C'!$D$62)","v":"Percent Soluble, %"}]
[34,{"$f":"IF('Tex-501-C'!$E$64=\"\",\"\",'Tex-501-C'!$E$64)","v":""},{"$f":"IF('Tex-501-C'!$B$60=\"\",\"\",'Tex-501-C'!$B$60)","v":"Tex 507-C : Solubility of Bituminous Materials"},{"$f":"IF('Tex-501-C'!$D$64=\"\",\"\",'Tex-501-C'!$D$64)","v":"Percent Insoluble, %"}]
[35,{"$f":"IF('Tex-501-C'!$E$67=\"\",\"\",'Tex-501-C'!$E$67)","v":""},{"$f":"IF('Tex-501-C'!$B$60=\"\",\"\",'Tex-501-C'!$B$60)","v":"Tex 507-C : Solubility of Bituminous Materials"},{"$f":"IF('Tex-501-C'!$D$67=\"\",\"\",'Tex-501-C'!$D$67)","v":"Weight of Crucible and Filter, g"},{"$f":"IF('Tex-501-C'!$E$66=\"\",\"\",'Tex-501-C'!$E$66)","v":"A"}]
[36,{"$f":"IF('Tex-501-C'!$F$67=\"\",\"\",'Tex-501-C'!$F$67)","v":""},{"$f":"IF('Tex-501-C'!$B$60=\"\",\"\",'Tex-501-C'!$B$60)","v":"Tex 507-C : Solubility of Bituminous Materials"},{"$f":"IF('Tex-501-C'!$D$67=\"\",\"\",'Tex-501-C'!$D$67)","v":"Weight of Crucible and Filter, g"},{"$f":"IF('Tex-501-C'!$F$66=\"\",\"\",'Tex-501-C'!$F$66)","v":"B"}]
[37,{"$f":"IF('Tex-501-C'!$G$67=\"\",\"\",'Tex-501-C'!$G$67)","v":""},{"$f":"IF('Tex-501-C'!$B$60=\"\",\"\",'Tex-501-C'!$B$60)","v":"Tex 507-C : Solubility of Bituminous Materials"},{"$f":"IF('Tex-501-C'!$D$67=\"\",\"\",'Tex-501-C'!$D$67)","v":"Weight of Crucible and Filter, g"},{"$f":"IF('Tex-501-C'!$G$66=\"\",\"\",'Tex-501-C'!$G$66)","v":"C"}]
[38,{"$f":"IF('Tex-501-C'!$E$68=\"\",\"\",'Tex-501-C'!$E$68)","v":""},{"$f":"IF('Tex-501-C'!$B$60=\"\",\"\",'Tex-501-C'!$B$60)","v":"Tex 507-C : Solubility of Bituminous Materials"},{"$f":"IF('Tex-501-C'!$D$68=\"\",\"\",'Tex-501-C'!$D$68)","v":"Weight of Flask, g"},{"$f":"IF('Tex-501-C'!$E$66=\"\",\"\",'Tex-501-C'!$E$66)","v":"A"}]
[39,{"$f":"IF('Tex-501-C'!$F$68=\"\",\"\",'Tex-501-C'!$F$68)","v":""},{"$f":"IF('Tex-501-C'!$B$60=\"\",\"\",'Tex-501-C'!$B$60)","v":"Tex 507-C : Solubility of Bituminous Materials"},{"$f":"IF('Tex-501-C'!$D$68=\"\",\"\",'Tex-501-C'!$D$68)","v":"Weight of Flask, g"},{"$f":"IF('Tex-501-C'!$F$66=\"\",\"\",'Tex-501-C'!$F$66)","v":"B"}]
[40,{"$f":"IF('Tex-501-C'!$G$68=\"\",\"\",'Tex-501-C'!$G$68)","v":""},{"$f":"IF('Tex-501-C'!$B$60=\"\",\"\",'Tex-501-C'!$B$60)","v":"Tex 507-C : Solubility of Bituminous Materials"},{"$f":"IF('Tex-501-C'!$D$68=\"\",\"\",'Tex-501-C'!$D$68)","v":"Weight of Flask, g"},{"$f":"IF('Tex-501-C'!$G$66=\"\",\"\",'Tex-501-C'!$G$66)","v":"C"}]
[41,{"$f":"IF('Tex-501-C'!$E$70=\"\",\"\",'Tex-501-C'!$E$70)","v":""},{"$f":"IF('Tex-501-C'!$B$60=\"\",\"\",'Tex-501-C'!$B$60)","v":"Tex 507-C : Solubility of Bituminous Materials"},{"$f":"IF('Tex-501-C'!$D$70=\"\",\"\",'Tex-501-C'!$D$70)","v":"Weight of Flask and Sample, g"},{"$f":"IF('Tex-501-C'!$E$66=\"\",\"\",'Tex-501-C'!$E$66)","v":"A"}]
[42,{"$f":"IF('Tex-501-C'!$F$70=\"\",\"\",'Tex-501-C'!$F$70)","v":""},{"$f":"IF('Tex-501-C'!$B$60=\"\",\"\",'Tex-501-C'!$B$60)","v":"Tex 507-C : Solubility of Bituminous Materials"},{"$f":"IF('Tex-501-C'!$D$70=\"\",\"\",'Tex-501-C'!$D$70)","v":"Weight of Flask and Sample, g"},{"$f":"IF('Tex-501-C'!$F$66=\"\",\"\",'Tex-501-C'!$F$66)","v":"B"}]
[43,{"$f":"IF('Tex-501-C'!$G$70=\"\",\"\",'Tex-501-C'!$G$70)","v":""},{"$f":"IF('Tex-501-C'!$B$60=\"\",\"\",'Tex-501-C'!$B$60)","v":"Tex 507-C : Solubility of Bituminous Materials"},{"$f":"IF('Tex-501-C'!$D$70=\"\",\"\",'Tex-501-C'!$D$70)","v":"Weight of Flask and Sample, g"},{"$f":"IF('Tex-501-C'!$G$66=\"\",\"\",'Tex-501-C'!$G$66)","v":"C"}]
[44,{"$f":"IF('Tex-501-C'!$E$71=\"\",\"\",'Tex-501-C'!$E$71)","v":""},{"$f":"IF('Tex-501-C'!$B$60=\"\",\"\",'Tex-501-C'!$B$60)","v":"Tex 507-C : Solubility of Bituminous Materials"},{"$f":"IF('Tex-501-C'!$D$71=\"\",\"\",'Tex-501-C'!$D$71)","v":"Weight of Sample, g"},{"$f":"IF('Tex-501-C'!$E$66=\"\",\"\",'Tex-501-C'!$E$66)","v":"A"}]
[45,{"$f":"IF('Tex-501-C'!$F$71=\"\",\"\",'Tex-501-C'!$F$71)","v":""},{"$f":"IF('Tex-501-C'!$B$60=\"\",\"\",'Tex-501-C'!$B$60)","v":"Tex 507-C : Solubility of Bituminous Materials"},{"$f":"IF('Tex-501-C'!$D$71=\"\",\"\",'Tex-501-C'!$D$71)","v":"Weight of Sample, g"},{"$f":"IF('Tex-501-C'!$F$66=\"\",\"\",'Tex-501-C'!$F$66)","v":"B"}]
[46,{"$f":"IF('Tex-501-C'!$G$71=\"\",\"\",'Tex-501-C'!$G$71)","v":""},{"$f":"IF('Tex-501-C'!$B$60=\"\",\"\",'Tex-501-C'!$B$60)","v":"Tex 507-C : Solubility of Bituminous Materials"},{"$f":"IF('Tex-501-C'!$D$71=\"\",\"\",'Tex-501-C'!$D$71)","v":"Weight of Sample, g"},{"$f":"IF('Tex-501-C'!$G$66=\"\",\"\",'Tex-501-C'!$G$66)","v":"C"}]
[47,{"$f":"IF('Tex-501-C'!$E$73=\"\",\"\",'Tex-501-C'!$E$73)","v":""},{"$f":"IF('Tex-501-C'!$B$60=\"\",\"\",'Tex-501-C'!$B$60)","v":"Tex 507-C : Solubility of Bituminous Materials"},{"$f":"IF('Tex-501-C'!$D$73=\"\",\"\",'Tex-501-C'!$D$73)","v":"Weight of Crucible, Filter & Sample, g"},{"$f":"IF('Tex-501-C'!$E$66=\"\",\"\",'Tex-501-C'!$E$66)","v":"A"}]
[48,{"$f":"IF('Tex-501-C'!$F$73=\"\",\"\",'Tex-501-C'!$F$73)","v":""},{"$f":"IF('Tex-501-C'!$B$60=\"\",\"\",'Tex-501-C'!$B$60)","v":"Tex 507-C : Solubility of Bituminous Materials"},{"$f":"IF('Tex-501-C'!$D$73=\"\",\"\",'Tex-501-C'!$D$73)","v":"Weight of Crucible, Filter & Sample, g"},{"$f":"IF('Tex-501-C'!$F$66=\"\",\"\",'Tex-501-C'!$F$66)","v":"B"}]
[49,{"$f":"IF('Tex-501-C'!$G$73=\"\",\"\",'Tex-501-C'!$G$73)","v":""},{"$f":"IF('Tex-501-C'!$B$60=\"\",\"\",'Tex-501-C'!$B$60)","v":"Tex 507-C : Solubility of Bituminous Materials"},{"$f":"IF('Tex-501-C'!$D$73=\"\",\"\",'Tex-501-C'!$D$73)","v":"Weight of Crucible, Filter & Sample, g"},{"$f":"IF('Tex-501-C'!$G$66=\"\",\"\",'Tex-501-C'!$G$66)","v":"C"}]
[50,{"$f":"IF('Tex-501-C'!$E$74=\"\",\"\",'Tex-501-C'!$E$74)","v":""},{"$f":"IF('Tex-501-C'!$B$60=\"\",\"\",'Tex-501-C'!$B$60)","v":"Tex 507-C : Solubility of Bituminous Materials"},{"$f":"IF('Tex-501-C'!$D$74=\"\",\"\",'Tex-501-C'!$D$74)","v":"Sample Retained on Filter, g"},{"$f":"IF('Tex-501-C'!$E$66=\"\",\"\",'Tex-501-C'!$E$66)","v":"A"}]
[51,{"$f":"IF('Tex-501-C'!$F$74=\"\",\"\",'Tex-501-C'!$F$74)","v":""},{"$f":"IF('Tex-501-C'!$B$60=\"\",\"\",'Tex-501-C'!$B$60)","v":"Tex 507-C : Solubility of Bituminous Materials"},{"$f":"IF('Tex-501-C'!$D$74=\"\",\"\",'Tex-501-C'!$D$74)","v":"Sample Retained on Filter, g"},{"$f":"IF('Tex-501-C'!$F$66=\"\",\"\",'Tex-501-C'!$F$66)","v":"B"}]
[52,{"$f":"IF('Tex-501-C'!$G$74=\"\",\"\",'Tex-501-C'!$G$74)","v":""},{"$f":"IF('Tex-501-C'!$B$60=\"\",\"\",'Tex-501-C'!$B$60)","v":"Tex 507-C : Solubility of Bituminous Materials"},{"$f":"IF('Tex-501-C'!$D$74=\"\",\"\",'Tex-501-C'!$D$74)","v":"Sample Retained on Filter, g"},{"$f":"IF('Tex-501-C'!$G$66=\"\",\"\",'Tex-501-C'!$G$66)","v":"C"}]
[53,{"$f":"IF('Tex-501-C'!$E$75=\"\",\"\",'Tex-501-C'!$E$75)","v":""},{"$f":"IF('Tex-501-C'!$B$60=\"\",\"\",'Tex-501-C'!$B$60)","v":"Tex 507-C : Solubility of Bituminous Materials"},{"$f":"IF('Tex-501-C'!$B$75=\"\",\"\",'Tex-501-C'!$B$75)","v":"Percent of sample retained on Filter, %:"},{"$f":"IF('Tex-501-C'!$E$66=\"\",\"\",'Tex-501-C'!$E$66)","v":"A"}]
[54,{"$f":"IF('Tex-501-C'!$F$75=\"\",\"\",'Tex-501-C'!$F$75)","v":""},{"$f":"IF('Tex-501-C'!$B$60=\"\",\"\",'Tex-501-C'!$B$60)","v":"Tex 507-C : Solubility of Bituminous Materials"},{"$f":"IF('Tex-501-C'!$B$75=\"\",\"\",'Tex-501-C'!$B$75)","v":"Percent of sample retained on Filter, %:"},{"$f":"IF('Tex-501-C'!$F$66=\"\",\"\",'Tex-501-C'!$F$66)","v":"B"}]
[55,{"$f":"IF('Tex-501-C'!$G$75=\"\",\"\",'Tex-501-C'!$G$75)","v":""},{"$f":"IF('Tex-501-C'!$B$60=\"\",\"\",'Tex-501-C'!$B$60)","v":"Tex 507-C : Solubility of Bituminous Materials"},{"$f":"IF('Tex-501-C'!$B$75=\"\",\"\",'Tex-501-C'!$B$75)","v":"Percent of sample retained on Filter, %:"},{"$f":"IF('Tex-501-C'!$G$66=\"\",\"\",'Tex-501-C'!$G$66)","v":"C"}]
[56,{"$f":"IF('Tex-501-C'!$G$76=\"\",\"\",'Tex-501-C'!$G$76)","v":""},{"$f":"IF('Tex-501-C'!$B$60=\"\",\"\",'Tex-501-C'!$B$60)","v":"Tex 507-C : Solubility of Bituminous Materials"},{"$f":"IF('Tex-501-C'!$F$76=\"\",\"\",'Tex-501-C'!$F$76)","v":"Average"}]
[57,{"$f":"IF('Tex-501-C'!$F$80=\"\",\"\",'Tex-501-C'!$F$80)","v":""},{"$f":"IF('Tex-501-C'!$B$78=\"\",\"\",'Tex-501-C'!$B$78)","v":"Tex 508-C : Specific Gravity and Density of Semi-Solid Bituminous Materials"},{"$f":"IF('Tex-501-C'!$C$80=\"\",\"\",'Tex-501-C'!$C$80)","v":"Specif Gravity at 60º Fahrenheit"}]
[58,{"$f":"IF('Tex-501-C'!$H$80=\"\",\"\",'Tex-501-C'!$H$80)","v":""},{"$f":"IF('Tex-501-C'!$B$78=\"\",\"\",'Tex-501-C'!$B$78)","v":"Tex 508-C : Specific Gravity and Density of Semi-Solid Bituminous Materials"},{"$f":"IF('Tex-501-C'!$G$80=\"\",\"\",'Tex-501-C'!$G$80)","v":" 77º Fahrenheit"}]
[59,{"$f":"IF('Tex-501-C'!$F$82=\"\",\"\",'Tex-501-C'!$F$82)","v":""},{"$f":"IF('Tex-501-C'!$B$78=\"\",\"\",'Tex-501-C'!$B$78)","v":"Tex 508-C : Specific Gravity and Density of Semi-Solid Bituminous Materials"},{"$f":"IF('Tex-501-C'!$E$82=\"\",\"\",'Tex-501-C'!$E$82)","v":"Pycnometer Number"}]
[60,{"$f":"IF('Tex-501-C'!$F$84=\"\",\"\",'Tex-501-C'!$F$84)","v":""},{"$f":"IF('Tex-501-C'!$B$78=\"\",\"\",'Tex-501-C'!$B$78)","v":"Tex 508-C : Specific Gravity and Density of Semi-Solid Bituminous Materials"},{"$f":"IF('Tex-501-C'!$E$84=\"\",\"\",'Tex-501-C'!$E$84)","v":"Weight of Pycnometer & Sample, g"}]
[61,{"$f":"IF('Tex-501-C'!$F$85=\"\",\"\",'Tex-501-C'!$F$85)","v":""},{"$f":"IF('Tex-501-C'!$B$78=\"\",\"\",'Tex-501-C'!$B$78)","v":"Tex 508-C : Specific Gravity and Density of Semi-Solid Bituminous Materials"},{"$f":"IF('Tex-501-C'!$E$85=\"\",\"\",'Tex-501-C'!$E$85)","v":"Calibrated Weight of Pycnometer, g"}]
[62,{"$f":"IF('Tex-501-C'!$F$86=\"\",\"\",'Tex-501-C'!$F$86)","v":""},{"$f":"IF('Tex-501-C'!$B$78=\"\",\"\",'Tex-501-C'!$B$78)","v":"Tex 508-C : Specific Gravity and Density of Semi-Solid Bituminous Materials"},{"$f":"IF('Tex-501-C'!$E$86=\"\",\"\",'Tex-501-C'!$E$86)","v":"Weight of Sample, g"}]
[63,{"$f":"IF('Tex-501-C'!$F$88=\"\",\"\",'Tex-501-C'!$F$88)","v":""},{"$f":"IF('Tex-501-C'!$B$78=\"\",\"\",'Tex-501-C'!$B$78)","v":"Tex 508-C : Specific Gravity and Density of Semi-Solid Bituminous Materials"},{"$f":"IF('Tex-501-C'!$E$88=\"\",\"\",'Tex-501-C'!$E$88)","v":"Weight of Pyc,Sample & Water, g"}]
[64,{"$f":"IF('Tex-501-C'!$F$89=\"\",\"\",'Tex-501-C'!$F$89)","v":""},{"$f":"IF('Tex-501-C'!$B$78=\"\",\"\",'Tex-501-C'!$B$78)","v":"Tex 508-C : Specific Gravity and Density of Semi-Solid Bituminous Materials"},{"$f":"IF('Tex-501-C'!$E$89=\"\",\"\",'Tex-501-C'!$E$89)","v":"Weight of Pycnometer & Sample, g"}]
[65,{"$f":"IF('Tex-501-C'!$F$90=\"\",\"\",'Tex-501-C'!$F$90)","v":""},{"$f":"IF('Tex-501-C'!$B$78=\"\",\"\",'Tex-501-C'!$B$78)","v":"Tex 508-C : Specific Gravity and Density of Semi-Solid Bituminous Materials"},{"$f":"IF('Tex-501-C'!$E$90=\"\",\"\",'Tex-501-C'!$E$90)","v":"Calibrated Weight of Water, g"}]
[66,{"$f":"IF('Tex-501-C'!$F$91=\"\",\"\",'Tex-501-C'!$F$91)","v":""},{"$f":"IF('Tex-501-C'!$B$78=\"\",\"\",'Tex-501-C'!$B$78)","v":"Tex 508-C : Specific Gravity and Density of Semi-Solid Bituminous Materials"},{"$f":"IF('Tex-501-C'!$E$91=\"\",\"\",'Tex-501-C'!$E$91)","v":"Weight of Water, g"}]
[67,{"$f":"IF('Tex-501-C'!$F$92=\"\",\"\",'Tex-501-C'!$F$92)","v":""},{"$f":"IF('Tex-501-C'!$B$78=\"\",\"\",'Tex-501-C'!$B$78)","v":"Tex 508-C : Specific Gravity and Density of Semi-Solid Bituminous Materials"},{"$f":"IF('Tex-501-C'!$E$92=\"\",\"\",'Tex-501-C'!$E$92)","v":"Water Displaced by Sample, g"}]
[68,{"$f":"IF('Tex-501-C'!$F$94=\"\",\"\",'Tex-501-C'!$F$94)","v":""},{"$f":"IF('Tex-501-C'!$B$78=\"\",\"\",'Tex-501-C'!$B$78)","v":"Tex 508-C : Specific Gravity and Density of Semi-Solid Bituminous Materials"},{"$f":"IF('Tex-501-C'!$E$94=\"\",\"\",'Tex-501-C'!$E$94)","v":"Specific Gravity"}]
[69,{"$f":"IF('Tex-501-C'!$F$100=\"\",\"\",'Tex-501-C'!$F$100)","v":""},{"$f":"IF('Tex-501-C'!$B$96=\"\",\"\",'Tex-501-C'!$B$96)","v":"Tex 510-C :  Thin-Film Oven Test (Tests on Residue)"},{"$f":"IF('Tex-501-C'!$C$100=\"\",\"\",'Tex-501-C'!$C$100)","v":"Penetration at º F, dmm "}]
[70,{"$f":"IF('Tex-501-C'!$F$102=\"\",\"\",'Tex-501-C'!$F$102)","v":""},{"$f":"IF('Tex-501-C'!$B$96=\"\",\"\",'Tex-501-C'!$B$96)","v":"Tex 510-C :  Thin-Film Oven Test (Tests on Residue)"},{"$f":"IF('Tex-501-C'!$E$102=\"\",\"\",'Tex-501-C'!$E$102)","v":"Temperature, ºF"}]
[71,{"$f":"IF('Tex-501-C'!$F$106=\"\",\"\",'Tex-501-C'!$F$106)","v":""},{"$f":"IF('Tex-501-C'!$B$96=\"\",\"\",'Tex-501-C'!$B$96)","v":"Tex 510-C :  Thin-Film Oven Test (Tests on Residue)"},{"$f":"IF('Tex-501-C'!$E$106=\"\",\"\",'Tex-501-C'!$E$106)","v":"Ductility at ºF, cm"}]
[72,{"$f":"IF('Tex-501-C'!$F$108=\"\",\"\",'Tex-501-C'!$F$108)","v":""},{"$f":"IF('Tex-501-C'!$B$96=\"\",\"\",'Tex-501-C'!$B$96)","v":"Tex 510-C :  Thin-Film Oven Test (Tests on Residue)"},{"$f":"IF('Tex-501-C'!$E$108=\"\",\"\",'Tex-501-C'!$E$108)","v":"Temperature, ºF"}]
[73,{"$f":"IF('Tex-501-C'!$F$110=\"\",\"\",'Tex-501-C'!$F$110)","v":""},{"$f":"IF('Tex-501-C'!$B$96=\"\",\"\",'Tex-501-C'!$B$96)","v":"Tex 510-C :  Thin-Film Oven Test (Tests on Residue)"},{"$f":"IF('Tex-501-C'!$D$110=\"\",\"\",'Tex-501-C'!$D$110)","v":"Travel Speed, cm/min"}]
[74,{"$f":"IF('Tex-501-C'!$F$113=\"\",\"\",'Tex-501-C'!$F$113)","v":""},{"$f":"IF('Tex-501-C'!$B$96=\"\",\"\",'Tex-501-C'!$B$96)","v":"Tex 510-C :  Thin-Film Oven Test (Tests on Residue)"},{"$f":"IF('Tex-501-C'!$E$113=\"\",\"\",'Tex-501-C'!$E$113)","v":"Viscosity at 140º Fahrenheit, poise"}]
[75,{"$f":"IF('Tex-501-C'!$F$115=\"\",\"\",'Tex-501-C'!$F$115)","v":""},{"$f":"IF('Tex-501-C'!$B$96=\"\",\"\",'Tex-501-C'!$B$96)","v":"Tex 510-C :  Thin-Film Oven Test (Tests on Residue)"},{"$f":"IF('Tex-501-C'!$E$115=\"\",\"\",'Tex-501-C'!$E$115)","v":"Tube Number"}]
[76,{"$f":"IF('Tex-501-C'!$F$116=\"\",\"\",'Tex-501-C'!$F$116)","v":""},{"$f":"IF('Tex-501-C'!$B$96=\"\",\"\",'Tex-501-C'!$B$96)","v":"Tex 510-C :  Thin-Film Oven Test (Tests on Residue)"},{"$f":"IF('Tex-501-C'!$E$116=\"\",\"\",'Tex-501-C'!$E$116)","v":"Size"}]
[77,{"$f":"IF('Tex-501-C'!$E$120=\"\",\"\",'Tex-501-C'!$E$120)","v":""},{"$f":"IF('Tex-501-C'!$B$96=\"\",\"\",'Tex-501-C'!$B$96)","v":"Tex 510-C :  Thin-Film Oven Test (Tests on Residue)"},{"$f":"IF('Tex-501-C'!$E$118=\"\",\"\",'Tex-501-C'!$E$118)","v":"Time, seconds"}]
[78,{"$f":"IF('Tex-501-C'!$F$120=\"\",\"\",'Tex-501-C'!$F$120)","v":""},{"$f":"IF('Tex-501-C'!$B$96=\"\",\"\",'Tex-501-C'!$B$96)","v":"Tex 510-C :  Thin-Film Oven Test (Tests on Residue)"},{"$f":"IF('Tex-501-C'!$F$118=\"\",\"\",'Tex-501-C'!$F$118)","v":"Viscosity Constant"}]
[79,{"$f":"IF('Tex-501-C'!$G$120=\"\",\"\",'Tex-501-C'!$G$120)","v":""},{"$f":"IF('Tex-501-C'!$B$96=\"\",\"\",'Tex-501-C'!$B$96)","v":"Tex 510-C :  Thin-Film Oven Test (Tests on Residue)"},{"$f":"IF('Tex-501-C'!$G$118=\"\",\"\",'Tex-501-C'!$G$118)","v":"Viscosity, poise"}]
[80,{"$f":"IF('Tex-501-C'!$E$121=\"\",\"\",'Tex-501-C'!$E$121)","v":""},{"$f":"IF('Tex-501-C'!$B$96=\"\",\"\",'Tex-501-C'!$B$96)","v":"Tex 510-C :  Thin-Film Oven Test (Tests on Residue)"},{"$f":"IF('Tex-501-C'!$E$118=\"\",\"\",'Tex-501-C'!$E$118)","v":"Time, seconds"}]
[81,{"$f":"IF('Tex-501-C'!$F$121=\"\",\"\",'Tex-501-C'!$F$121)","v":""},{"$f":"IF('Tex-501-C'!$B$96=\"\",\"\",'Tex-501-C'!$B$96)","v":"Tex 510-C :  Thin-Film Oven Test (Tests on Residue)"},{"$f":"IF('Tex-501-C'!$F$118=\"\",\"\",'Tex-501-C'!$F$118)","v":"Viscosity Constant"}]
[82,{"$f":"IF('Tex-501-C'!$G$121=\"\",\"\",'Tex-501-C'!$G$121)","v":""},{"$f":"IF('Tex-501-C'!$B$96=\"\",\"\",'Tex-501-C'!$B$96)","v":"Tex 510-C :  Thin-Film Oven Test (Tests on Residue)"},{"$f":"IF('Tex-501-C'!$G$118=\"\",\"\",'Tex-501-C'!$G$118)","v":"Viscosity, poise"}]
[83,{"$f":"IF('Tex-501-C'!$G$123=\"\",\"\",'Tex-501-C'!$G$123)","v":""},{"$f":"IF('Tex-501-C'!$B$96=\"\",\"\",'Tex-501-C'!$B$96)","v":"Tex 510-C :  Thin-Film Oven Test (Tests on Residue)"},{"$f":"IF('Tex-501-C'!$F$123=\"\",\"\",'Tex-501-C'!$F$123)","v":"Average"}]
[84,{"$f":"IF('Tex-501-C'!$F$126=\"\",\"\",'Tex-501-C'!$F$126)","v":""},{"$f":"IF('Tex-501-C'!$B$96=\"\",\"\",'Tex-501-C'!$B$96)","v":"Tex 510-C :  Thin-Film Oven Test (Tests on Residue)"},{"$f":"IF('Tex-501-C'!$E$126=\"\",\"\",'Tex-501-C'!$E$126)","v":"Viscosity at 275º Fahrenheit, poise"}]
[85,{"$f":"IF('Tex-501-C'!$F$128=\"\",\"\",'Tex-501-C'!$F$128)","v":""},{"$f":"IF('Tex-501-C'!$B$96=\"\",\"\",'Tex-501-C'!$B$96)","v":"Tex 510-C :  Thin-Film Oven Test (Tests on Residue)"},{"$f":"IF('Tex-501-C'!$E$128=\"\",\"\",'Tex-501-C'!$E$128)","v":"Tube Number"}]
[86,{"$f":"IF('Tex-501-C'!$F$129=\"\",\"\",'Tex-501-C'!$F$129)","v":""},{"$f":"IF('Tex-501-C'!$B$96=\"\",\"\",'Tex-501-C'!$B$96)","v":"Tex 510-C :  Thin-Film Oven Test (Tests on Residue)"},{"$f":"IF('Tex-501-C'!$E$129=\"\",\"\",'Tex-501-C'!$E$129)","v":"Size"}]
[87,{"$f":"IF('Tex-501-C'!$E$133=\"\",\"\",'Tex-501-C'!$E$133)","v":""},{"$f":"IF('Tex-501-C'!$B$96=\"\",\"\",'Tex-501-C'!$B$96)","v":"Tex 510-C :  Thin-Film Oven Test (Tests on Residue)"},{"$f":"IF('Tex-501-C'!$E$131=\"\",\"\",'Tex-501-C'!$E$131)","v":"Time, seconds"}]
[88,{"$f":"IF('Tex-501-C'!$F$133=\"\",\"\",'Tex-501-C'!$F$133)","v":""},{"$f":"IF('Tex-501-C'!$B$96=\"\",\"\",'Tex-501-C'!$B$96)","v":"Tex 510-C :  Thin-Film Oven Test (Tests on Residue)"},{"$f":"IF('Tex-501-C'!$F$131=\"\",\"\",'Tex-501-C'!$F$131)","v":"Viscosity Constant"}]
[89,{"$f":"IF('Tex-501-C'!$G$133=\"\",\"\",'Tex-501-C'!$G$133)","v":""},{"$f":"IF('Tex-501-C'!$B$96=\"\",\"\",'Tex-501-C'!$B$96)","v":"Tex 510-C :  Thin-Film Oven Test (Tests on Residue)"},{"$f":"IF('Tex-501-C'!$G$131=\"\",\"\",'Tex-501-C'!$G$131)","v":"Viscosity, poise"}]
[90,{"$f":"IF('Tex-501-C'!$E$134=\"\",\"\",'Tex-501-C'!$E$134)","v":""},{"$f":"IF('Tex-501-C'!$B$96=\"\",\"\",'Tex-501-C'!$B$96)","v":"Tex 510-C :  Thin-Film Oven Test (Tests on Residue)"},{"$f":"IF('Tex-501-C'!$E$131=\"\",\"\",'Tex-501-C'!$E$131)","v":"Time, seconds"}]
[91,{"$f":"IF('Tex-501-C'!$F$134=\"\",\"\",'Tex-501-C'!$F$134)","v":""},{"$f":"IF('Tex-501-C'!$B$96=\"\",\"\",'Tex-501-C'!$B$96)","v":"Tex 510-C :  Thin-Film Oven Test (Tests on Residue)"},{"$f":"IF('Tex-501-C'!$F$131=\"\",\"\",'Tex-501-C'!$F$131)","v":"Viscosity Constant"}]
[92,{"$f":"IF('Tex-501-C'!$G$134=\"\",\"\",'Tex-501-C'!$G$134)","v":""},{"$f":"IF('Tex-501-C'!$B$96=\"\",\"\",'Tex-501-C'!$B$96)","v":"Tex 510-C :  Thin-Film Oven Test (Tests on Residue)"},{"$f":"IF('Tex-501-C'!$G$131=\"\",\"\",'Tex-501-C'!$G$131)","v":"Viscosity, poise"}]
[93,{"$f":"IF('Tex-501-C'!$G$136=\"\",\"\",'Tex-501-C'!$G$136)","v":""},{"$f":"IF('Tex-501-C'!$B$96=\"\",\"\",'Tex-501-C'!$B$96)","v":"Tex 510-C :  Thin-Film Oven Test (Tests on Residue)"},{"$f":"IF('Tex-501-C'!$F$136=\"\",\"\",'Tex-501-C'!$F$136)","v":"Average"}]
[94,{"$f":"IF('Tex-501-C'!$F$140=\"\",\"\",'Tex-501-C'!$F$140)","v":""},{"$f":"IF('Tex-501-C'!$B$138=\"\",\"\",'Tex-501-C'!$B$138)","v":"Tex 512-C : Flash Point with Tag Open-Cup Appartus"},{"$f":"IF('Tex-501-C'!$E$140=\"\",\"\",'Tex-501-C'!$E$140)","v":"Flash Point by Tag Open Cup, ºF"}]
[95,{"$f":"IF('Tex-501-C'!$F$144=\"\",\"\",'Tex-501-C'!$F$144)","v":""},{"$f":"IF('Tex-501-C'!$B$142=\"\",\"\",'Tex-501-C'!$B$142)","v":"Tex 513-C : Saybolt Viscosity"},{"$f":"IF('Tex-501-C'!$E$144=\"\",\"\",'Tex-501-C'!$E$144)","v":"Saybolt Viscosity at ºF, (Saybolt Seconds)"}]
[96,{"$f":"IF('Tex-501-C'!$F$146=\"\",\"\",'Tex-501-C'!$F$146)","v":""},{"$f":"IF('Tex-501-C'!$B$142=\"\",\"\",'Tex-501-C'!$B$142)","v":"Tex 513-C : Saybolt Viscosity"},{"$f":"IF('Tex-501-C'!$E$146=\"\",\"\",'Tex-501-C'!$E$146)","v":"Temperature, °F"}]
[97,{"$f":"IF('Tex-501-C'!$F$147=\"\",\"\",'Tex-501-C'!$F$147)","v":""},{"$f":"IF('Tex-501-C'!$B$142=\"\",\"\",'Tex-501-C'!$B$142)","v":"Tex 513-C : Saybolt Viscosity"},{"$f":"IF('Tex-501-C'!$E$147=\"\",\"\",'Tex-501-C'!$E$147)","v":"Correction Factor"}]
[98,{"$f":"IF('Tex-501-C'!$F$148=\"\",\"\",'Tex-501-C'!$F$148)","v":""},{"$f":"IF('Tex-501-C'!$B$142=\"\",\"\",'Tex-501-C'!$B$142)","v":"Tex 513-C : Saybolt Viscosity"},{"$f":"IF('Tex-501-C'!$C$148=\"\",\"\",'Tex-501-C'!$C$148)","v":"Observed Time, Saybolt Seconds"}]
[99,{"$f":"IF('Tex-501-C'!$G$152=\"\",\"\",'Tex-501-C'!$G$152)","v":""},{"$f":"IF('Tex-501-C'!$B$150=\"\",\"\",'Tex-501-C'!$B$150)","v":"Tex 514-C : API Gravity of Liquid Asphalts by Hydrometer Method"},{"$f":"IF('Tex-501-C'!$F$152=\"\",\"\",'Tex-501-C'!$F$152)","v":"SPECIFIC GRAVITY AT 60°F:"}]
[100,{"$f":"IF('Tex-501-C'!$F$154=\"\",\"\",'Tex-501-C'!$F$154)","v":""},{"$f":"IF('Tex-501-C'!$B$150=\"\",\"\",'Tex-501-C'!$B$150)","v":"Tex 514-C : API Gravity of Liquid Asphalts by Hydrometer Method"},{"$f":"IF('Tex-501-C'!$E$154=\"\",\"\",'Tex-501-C'!$E$154)","v":"Actual Temperature.:"}]
[101,{"$f":"IF('Tex-501-C'!$F$155=\"\",\"\",'Tex-501-C'!$F$155)","v":""},{"$f":"IF('Tex-501-C'!$B$150=\"\",\"\",'Tex-501-C'!$B$150)","v":"Tex 514-C : API Gravity of Liquid Asphalts by Hydrometer Method"},{"$f":"IF('Tex-501-C'!$E$155=\"\",\"\",'Tex-501-C'!$E$155)","v":"Observed API Reading"}]
[102,{"$f":"IF('Tex-501-C'!$F$156=\"\",\"\",'Tex-501-C'!$F$156)","v":""},{"$f":"IF('Tex-501-C'!$B$150=\"\",\"\",'Tex-501-C'!$B$150)","v":"Tex 514-C : API Gravity of Liquid Asphalts by Hydrometer Method"},{"$f":"IF('Tex-501-C'!$C$156=\"\",\"\",'Tex-501-C'!$C$156)","v":"API Gravity at 60°F , (Saybolt Seconds):"}]
[103,{"$f":"IF('Tex-501-C'!$G$160=\"\",\"\",'Tex-501-C'!$G$160)","v":""},{"$f":"IF('Tex-501-C'!$B$158=\"\",\"\",'Tex-501-C'!$B$158)","v":"Tex 514-C : Weight per Gallon of Emulsified Asphalt"},{"$f":"IF('Tex-501-C'!$F$160=\"\",\"\",'Tex-501-C'!$F$160)","v":"SPECIFIC GRAVITY AT 60°F:"}]
[104,{"$f":"IF('Tex-501-C'!$F$162=\"\",\"\",'Tex-501-C'!$F$162)","v":""},{"$f":"IF('Tex-501-C'!$B$158=\"\",\"\",'Tex-501-C'!$B$158)","v":"Tex 514-C : Weight per Gallon of Emulsified Asphalt"},{"$f":"IF('Tex-501-C'!$E$162=\"\",\"\",'Tex-501-C'!$E$162)","v":"Gallon Cup Number :"}]
[105,{"$f":"IF('Tex-501-C'!$F$164=\"\",\"\",'Tex-501-C'!$F$164)","v":""},{"$f":"IF('Tex-501-C'!$B$158=\"\",\"\",'Tex-501-C'!$B$158)","v":"Tex 514-C : Weight per Gallon of Emulsified Asphalt"},{"$f":"IF('Tex-501-C'!$E$164=\"\",\"\",'Tex-501-C'!$E$164)","v":"Weight of Sample and Gallon Cup, g:"}]
[106,{"$f":"IF('Tex-501-C'!$F$165=\"\",\"\",'Tex-501-C'!$F$165)","v":""},{"$f":"IF('Tex-501-C'!$B$158=\"\",\"\",'Tex-501-C'!$B$158)","v":"Tex 514-C : Weight per Gallon of Emulsified Asphalt"},{"$f":"IF('Tex-501-C'!$E$165=\"\",\"\",'Tex-501-C'!$E$165)","v":"Weight of Gallon Cup, g:"}]
[107,{"$f":"IF('Tex-501-C'!$F$166=\"\",\"\",'Tex-501-C'!$F$166)","v":""},{"$f":"IF('Tex-501-C'!$B$158=\"\",\"\",'Tex-501-C'!$B$158)","v":"Tex 514-C : Weight per Gallon of Emulsified Asphalt"},{"$f":"IF('Tex-501-C'!$E$166=\"\",\"\",'Tex-501-C'!$E$166)","v":"Sample Weight, g:"}]
[108,{"$f":"IF('Tex-501-C'!$F$167=\"\",\"\",'Tex-501-C'!$F$167)","v":""},{"$f":"IF('Tex-501-C'!$B$158=\"\",\"\",'Tex-501-C'!$B$158)","v":"Tex 514-C : Weight per Gallon of Emulsified Asphalt"},{"$f":"IF('Tex-501-C'!$E$167=\"\",\"\",'Tex-501-C'!$E$167)","v":"Conversion to 60º Fahrenheit, Lbs/Gallon:"}]
[109,{"$f":"IF('Tex-501-C'!$F$168=\"\",\"\",'Tex-501-C'!$F$168)","v":""},{"$f":"IF('Tex-501-C'!$B$158=\"\",\"\",'Tex-501-C'!$B$158)","v":"Tex 514-C : Weight per Gallon of Emulsified Asphalt"},{"$f":"IF('Tex-501-C'!$E$168=\"\",\"\",'Tex-501-C'!$E$168)","v":"Lbs/Gallon of Water"}]
[110,{"$f":"IF('Tex-501-C'!$F$170=\"\",\"\",'Tex-501-C'!$F$170)","v":""},{"$f":"IF('Tex-501-C'!$B$158=\"\",\"\",'Tex-501-C'!$B$158)","v":"Tex 514-C : Weight per Gallon of Emulsified Asphalt"},{"$f":"IF('Tex-501-C'!$E$170=\"\",\"\",'Tex-501-C'!$E$170)","v":"Specific Gravity at 60º Fahrenheit"}]
[111,{"$f":"IF('Tex-501-C'!$F$174=\"\",\"\",'Tex-501-C'!$F$174)","v":""},{"$f":"IF('Tex-501-C'!$B$172=\"\",\"\",'Tex-501-C'!$B$172)","v":"Tex-515-C : Distillation of Cutback Asphaltic (Bituminous) Products"},{"$f":"IF('Tex-501-C'!$E$174=\"\",\"\",'Tex-501-C'!$E$174)","v":"ASPHALT RESIDUE, %, BY WEIGHT:"}]
[112,{"$f":"IF('Tex-501-C'!$H$174=\"\",\"\",'Tex-501-C'!$H$174)","v":""},{"$f":"IF('Tex-501-C'!$B$172=\"\",\"\",'Tex-501-C'!$B$172)","v":"Tex-515-C : Distillation of Cutback Asphaltic (Bituminous) Products"},{"$f":"IF('Tex-501-C'!$G$174=\"\",\"\",'Tex-501-C'!$G$174)","v":"BY VOL.:"}]
[113,{"$f":"IF('Tex-501-C'!$E$176=\"\",\"\",'Tex-501-C'!$E$176)","v":""},{"$f":"IF('Tex-501-C'!$B$172=\"\",\"\",'Tex-501-C'!$B$172)","v":"Tex-515-C : Distillation of Cutback Asphaltic (Bituminous) Products"},{"$f":"IF('Tex-501-C'!$D$176=\"\",\"\",'Tex-501-C'!$D$176)","v":"INITIAL BOILING POINT, °F:"}]
[114,{"$f":"IF('Tex-501-C'!$E$180=\"\",\"\",'Tex-501-C'!$E$180)","v":""},{"$f":"IF('Tex-501-C'!$B$172=\"\",\"\",'Tex-501-C'!$B$172)","v":"Tex-515-C : Distillation of Cutback Asphaltic (Bituminous) Products"},{"$f":"IF('Tex-501-C'!$E$178=\"\",\"\",'Tex-501-C'!$E$178)","v":"Distillate Volume (in ml)"},{"$f":"IF('Tex-501-C'!$D$180=\"\",\"\",'Tex-501-C'!$D$180)","v":"320°F"}]
[115,{"$f":"IF('Tex-501-C'!$F$180=\"\",\"\",'Tex-501-C'!$F$180)","v":""},{"$f":"IF('Tex-501-C'!$B$172=\"\",\"\",'Tex-501-C'!$B$172)","v":"Tex-515-C : Distillation of Cutback Asphaltic (Bituminous) Products"},{"$f":"IF('Tex-501-C'!$F$179=\"\",\"\",'Tex-501-C'!$F$179)","v":"Total Distillate"},{"$f":"IF('Tex-501-C'!$D$180=\"\",\"\",'Tex-501-C'!$D$180)","v":"320°F"}]
[116,{"$f":"IF('Tex-501-C'!$G$180=\"\",\"\",'Tex-501-C'!$G$180)","v":""},{"$f":"IF('Tex-501-C'!$B$172=\"\",\"\",'Tex-501-C'!$B$172)","v":"Tex-515-C : Distillation of Cutback Asphaltic (Bituminous) Products"},{"$f":"IF('Tex-501-C'!$G$179=\"\",\"\",'Tex-501-C'!$G$179)","v":"Total CB"},{"$f":"IF('Tex-501-C'!$D$180=\"\",\"\",'Tex-501-C'!$D$180)","v":"320°F"}]
[117,{"$f":"IF('Tex-501-C'!$E$181=\"\",\"\",'Tex-501-C'!$E$181)","v":""},{"$f":"IF('Tex-501-C'!$B$172=\"\",\"\",'Tex-501-C'!$B$172)","v":"Tex-515-C : Distillation of Cutback Asphaltic (Bituminous) Products"},{"$f":"IF('Tex-501-C'!$E$178=\"\",\"\",'Tex-501-C'!$E$178)","v":"Distillate Volume (in ml)"},{"$f":"IF('Tex-501-C'!$D$181=\"\",\"\",'Tex-501-C'!$D$181)","v":"347°F"}]
[118,{"$f":"IF('Tex-501-C'!$F$181=\"\",\"\",'Tex-501-C'!$F$181)","v":""},{"$f":"IF('Tex-501-C'!$B$172=\"\",\"\",'Tex-501-C'!$B$172)","v":"Tex-515-C : Distillation of Cutback Asphaltic (Bituminous) Products"},{"$f":"IF('Tex-501-C'!$F$179=\"\",\"\",'Tex-501-C'!$F$179)","v":"Total Distillate"},{"$f":"IF('Tex-501-C'!$D$181=\"\",\"\",'Tex-501-C'!$D$181)","v":"347°F"}]
[119,{"$f":"IF('Tex-501-C'!$G$181=\"\",\"\",'Tex-501-C'!$G$181)","v":""},{"$f":"IF('Tex-501-C'!$B$172=\"\",\"\",'Tex-501-C'!$B$172)","v":"Tex-515-C : Distillation of Cutback Asphaltic (Bituminous) Products"},{"$f":"IF('Tex-501-C'!$G$179=\"\",\"\",'Tex-501-C'!$G$179)","v":"Total CB"},{"$f":"IF('Tex-501-C'!$D$181=\"\",\"\",'Tex-501-C'!$D$181)","v":"347°F"}]
[120,{"$f":"IF('Tex-501-C'!$E$182=\"\",\"\",'Tex-501-C'!$E$182)","v":""},{"$f":"IF('Tex-501-C'!$B$172=\"\",\"\",'Tex-501-C'!$B$172)","v":"Tex-515-C : Distillation of Cutback Asphaltic (Bituminous) Products"},{"$f":"IF('Tex-501-C'!$E$178=\"\",\"\",'Tex-501-C'!$E$178)","v":"Distillate Volume (in ml)"},{"$f":"IF('Tex-501-C'!$D$182=\"\",\"\",'Tex-501-C'!$D$182)","v":"374°F"}]
[121,{"$f":"IF('Tex-501-C'!$F$182=\"\",\"\",'Tex-501-C'!$F$182)","v":""},{"$f":"IF('Tex-501-C'!$B$172=\"\",\"\",'Tex-501-C'!$B$172)","v":"Tex-515-C : Distillation of Cutback Asphaltic (Bituminous) Products"},{"$f":"IF('Tex-501-C'!$F$179=\"\",\"\",'Tex-501-C'!$F$179)","v":"Total Distillate"},{"$f":"IF('Tex-501-C'!$D$182=\"\",\"\",'Tex-501-C'!$D$182)","v":"374°F"}]
[122,{"$f":"IF('Tex-501-C'!$G$182=\"\",\"\",'Tex-501-C'!$G$182)","v":""},{"$f":"IF('Tex-501-C'!$B$172=\"\",\"\",'Tex-501-C'!$B$172)","v":"Tex-515-C : Distillation of Cutback Asphaltic (Bituminous) Products"},{"$f":"IF('Tex-501-C'!$G$179=\"\",\"\",'Tex-501-C'!$G$179)","v":"Total CB"},{"$f":"IF('Tex-501-C'!$D$182=\"\",\"\",'Tex-501-C'!$D$182)","v":"374°F"}]
[123,{"$f":"IF('Tex-501-C'!$E$183=\"\",\"\",'Tex-501-C'!$E$183)","v":""},{"$f":"IF('Tex-501-C'!$B$172=\"\",\"\",'Tex-501-C'!$B$172)","v":"Tex-515-C : Distillation of Cutback Asphaltic (Bituminous) Products"},{"$f":"IF('Tex-501-C'!$E$178=\"\",\"\",'Tex-501-C'!$E$178)","v":"Distillate Volume (in ml)"},{"$f":"IF('Tex-501-C'!$D$183=\"\",\"\",'Tex-501-C'!$D$183)","v":"437°F"}]
[124,{"$f":"IF('Tex-501-C'!$F$183=\"\",\"\",'Tex-501-C'!$F$183)","v":""},{"$f":"IF('Tex-501-C'!$B$172=\"\",\"\",'Tex-501-C'!$B$172)","v":"Tex-515-C : Distillation of Cutback Asphaltic (Bituminous) Products"},{"$f":"IF('Tex-501-C'!$F$179=\"\",\"\",'Tex-501-C'!$F$179)","v":"Total Distillate"},{"$f":"IF('Tex-501-C'!$D$183=\"\",\"\",'Tex-501-C'!$D$183)","v":"437°F"}]
[125,{"$f":"IF('Tex-501-C'!$G$183=\"\",\"\",'Tex-501-C'!$G$183)","v":""},{"$f":"IF('Tex-501-C'!$B$172=\"\",\"\",'Tex-501-C'!$B$172)","v":"Tex-515-C : Distillation of Cutback Asphaltic (Bituminous) Products"},{"$f":"IF('Tex-501-C'!$G$179=\"\",\"\",'Tex-501-C'!$G$179)","v":"Total CB"},{"$f":"IF('Tex-501-C'!$D$183=\"\",\"\",'Tex-501-C'!$D$183)","v":"437°F"}]
[126,{"$f":"IF('Tex-501-C'!$E$184=\"\",\"\",'Tex-501-C'!$E$184)","v":""},{"$f":"IF('Tex-501-C'!$B$172=\"\",\"\",'Tex-501-C'!$B$172)","v":"Tex-515-C : Distillation of Cutback Asphaltic (Bituminous) Products"},{"$f":"IF('Tex-501-C'!$E$178=\"\",\"\",'Tex-501-C'!$E$178)","v":"Distillate Volume (in ml)"},{"$f":"IF('Tex-501-C'!$D$184=\"\",\"\",'Tex-501-C'!$D$184)","v":"500°F"}]
[127,{"$f":"IF('Tex-501-C'!$F$184=\"\",\"\",'Tex-501-C'!$F$184)","v":""},{"$f":"IF('Tex-501-C'!$B$172=\"\",\"\",'Tex-501-C'!$B$172)","v":"Tex-515-C : Distillation of Cutback Asphaltic (Bituminous) Products"},{"$f":"IF('Tex-501-C'!$F$179=\"\",\"\",'Tex-501-C'!$F$179)","v":"Total Distillate"},{"$f":"IF('Tex-501-C'!$D$184=\"\",\"\",'Tex-501-C'!$D$184)","v":"500°F"}]
[128,{"$f":"IF('Tex-501-C'!$G$184=\"\",\"\",'Tex-501-C'!$G$184)","v":""},{"$f":"IF('Tex-501-C'!$B$172=\"\",\"\",'Tex-501-C'!$B$172)","v":"Tex-515-C : Distillation of Cutback Asphaltic (Bituminous) Products"},{"$f":"IF('Tex-501-C'!$G$179=\"\",\"\",'Tex-501-C'!$G$179)","v":"Total CB"},{"$f":"IF('Tex-501-C'!$D$184=\"\",\"\",'Tex-501-C'!$D$184)","v":"500°F"}]
[129,{"$f":"IF('Tex-501-C'!$E$185=\"\",\"\",'Tex-501-C'!$E$185)","v":""},{"$f":"IF('Tex-501-C'!$B$172=\"\",\"\",'Tex-501-C'!$B$172)","v":"Tex-515-C : Distillation of Cutback Asphaltic (Bituminous) Products"},{"$f":"IF('Tex-501-C'!$E$178=\"\",\"\",'Tex-501-C'!$E$178)","v":"Distillate Volume (in ml)"},{"$f":"IF('Tex-501-C'!$D$185=\"\",\"\",'Tex-501-C'!$D$185)","v":"600°F"}]
[130,{"$f":"IF('Tex-501-C'!$F$185=\"\",\"\",'Tex-501-C'!$F$185)","v":""},{"$f":"IF('Tex-501-C'!$B$172=\"\",\"\",'Tex-501-C'!$B$172)","v":"Tex-515-C : Distillation of Cutback Asphaltic (Bituminous) Products"},{"$f":"IF('Tex-501-C'!$F$179=\"\",\"\",'Tex-501-C'!$F$179)","v":"Total Distillate"},{"$f":"IF('Tex-501-C'!$D$185=\"\",\"\",'Tex-501-C'!$D$185)","v":"600°F"}]
[131,{"$f":"IF('Tex-501-C'!$G$185=\"\",\"\",'Tex-501-C'!$G$185)","v":""},{"$f":"IF('Tex-501-C'!$B$172=\"\",\"\",'Tex-501-C'!$B$172)","v":"Tex-515-C : Distillation of Cutback Asphaltic (Bituminous) Products"},{"$f":"IF('Tex-501-C'!$G$179=\"\",\"\",'Tex-501-C'!$G$179)","v":"Total CB"},{"$f":"IF('Tex-501-C'!$D$185=\"\",\"\",'Tex-501-C'!$D$185)","v":"600°F"}]
[132,{"$f":"IF('Tex-501-C'!$E$186=\"\",\"\",'Tex-501-C'!$E$186)","v":""},{"$f":"IF('Tex-501-C'!$B$172=\"\",\"\",'Tex-501-C'!$B$172)","v":"Tex-515-C : Distillation of Cutback Asphaltic (Bituminous) Products"},{"$f":"IF('Tex-501-C'!$E$178=\"\",\"\",'Tex-501-C'!$E$178)","v":"Distillate Volume (in ml)"},{"$f":"IF('Tex-501-C'!$D$186=\"\",\"\",'Tex-501-C'!$D$186)","v":"680°F"}]
[133,{"$f":"IF('Tex-501-C'!$F$186=\"\",\"\",'Tex-501-C'!$F$186)","v":""},{"$f":"IF('Tex-501-C'!$B$172=\"\",\"\",'Tex-501-C'!$B$172)","v":"Tex-515-C : Distillation of Cutback Asphaltic (Bituminous) Products"},{"$f":"IF('Tex-501-C'!$F$179=\"\",\"\",'Tex-501-C'!$F$179)","v":"Total Distillate"},{"$f":"IF('Tex-501-C'!$D$186=\"\",\"\",'Tex-501-C'!$D$186)","v":"680°F"}]
[134,{"$f":"IF('Tex-501-C'!$G$186=\"\",\"\",'Tex-501-C'!$G$186)","v":""},{"$f":"IF('Tex-501-C'!$B$172=\"\",\"\",'Tex-501-C'!$B$172)","v":"Tex-515-C : Distillation of Cutback Asphaltic (Bituminous) Products"},{"$f":"IF('Tex-501-C'!$G$179=\"\",\"\",'Tex-501-C'!$G$179)","v":"Total CB"},{"$f":"IF('Tex-501-C'!$D$186=\"\",\"\",'Tex-501-C'!$D$186)","v":"680°F"}]
[135,{"$f":"IF('Tex-501-C'!$F$188=\"\",\"\",'Tex-501-C'!$F$188)","v":""},{"$f":"IF('Tex-501-C'!$B$172=\"\",\"\",'Tex-501-C'!$B$172)","v":"Tex-515-C : Distillation of Cutback Asphaltic (Bituminous) Products"},{"$f":"IF('Tex-501-C'!$E$188=\"\",\"\",'Tex-501-C'!$E$188)","v":"Distillate, Gross, g:"}]
[136,{"$f":"IF('Tex-501-C'!$F$189=\"\",\"\",'Tex-501-C'!$F$189)","v":""},{"$f":"IF('Tex-501-C'!$B$172=\"\",\"\",'Tex-501-C'!$B$172)","v":"Tex-515-C : Distillation of Cutback Asphaltic (Bituminous) Products"},{"$f":"IF('Tex-501-C'!$E$189=\"\",\"\",'Tex-501-C'!$E$189)","v":"Tare, g:"}]
[137,{"$f":"IF('Tex-501-C'!$F$190=\"\",\"\",'Tex-501-C'!$F$190)","v":""},{"$f":"IF('Tex-501-C'!$B$172=\"\",\"\",'Tex-501-C'!$B$172)","v":"Tex-515-C : Distillation of Cutback Asphaltic (Bituminous) Products"},{"$f":"IF('Tex-501-C'!$E$190=\"\",\"\",'Tex-501-C'!$E$190)","v":"Distillate, Net, g:"}]
[138,{"$f":"IF('Tex-501-C'!$F$191=\"\",\"\",'Tex-501-C'!$F$191)","v":""},{"$f":"IF('Tex-501-C'!$B$172=\"\",\"\",'Tex-501-C'!$B$172)","v":"Tex-515-C : Distillation of Cutback Asphaltic (Bituminous) Products"},{"$f":"IF('Tex-501-C'!$E$191=\"\",\"\",'Tex-501-C'!$E$191)","v":"Charge, g:"}]
[139,{"$f":"IF('Tex-501-C'!$F$192=\"\",\"\",'Tex-501-C'!$F$192)","v":""},{"$f":"IF('Tex-501-C'!$B$172=\"\",\"\",'Tex-501-C'!$B$172)","v":"Tex-515-C : Distillation of Cutback Asphaltic (Bituminous) Products"},{"$f":"IF('Tex-501-C'!$E$192=\"\",\"\",'Tex-501-C'!$E$192)","v":"Res. by Weight, g:"}]
[140,{"$f":"IF('Tex-501-C'!$F$194=\"\",\"\",'Tex-501-C'!$F$194)","v":""},{"$f":"IF('Tex-501-C'!$B$172=\"\",\"\",'Tex-501-C'!$B$172)","v":"Tex-515-C : Distillation of Cutback Asphaltic (Bituminous) Products"},{"$f":"IF('Tex-501-C'!$E$194=\"\",\"\",'Tex-501-C'!$E$194)","v":"Cut-Back Specific Gravity:"}]
[141,{"$f":"IF('Tex-501-C'!$F$195=\"\",\"\",'Tex-501-C'!$F$195)","v":""},{"$f":"IF('Tex-501-C'!$B$172=\"\",\"\",'Tex-501-C'!$B$172)","v":"Tex-515-C : Distillation of Cutback Asphaltic (Bituminous) Products"},{"$f":"IF('Tex-501-C'!$E$195=\"\",\"\",'Tex-501-C'!$E$195)","v":"Intended Sample Volume, ml:"}]
[142,{"$f":"IF('Tex-501-C'!$F$196=\"\",\"\",'Tex-501-C'!$F$196)","v":""},{"$f":"IF('Tex-501-C'!$B$172=\"\",\"\",'Tex-501-C'!$B$172)","v":"Tex-515-C : Distillation of Cutback Asphaltic (Bituminous) Products"},{"$f":"IF('Tex-501-C'!$E$196=\"\",\"\",'Tex-501-C'!$E$196)","v":"Ideal sample weight, g:"}]
[143,{"$f":"IF('Tex-501-C'!$F$197=\"\",\"\",'Tex-501-C'!$F$197)","v":""},{"$f":"IF('Tex-501-C'!$B$172=\"\",\"\",'Tex-501-C'!$B$172)","v":"Tex-515-C : Distillation of Cutback Asphaltic (Bituminous) Products"},{"$f":"IF('Tex-501-C'!$E$197=\"\",\"\",'Tex-501-C'!$E$197)","v":"Actual sample weight, g:"}]
[144,{"$f":"IF('Tex-501-C'!$F$198=\"\",\"\",'Tex-501-C'!$F$198)","v":""},{"$f":"IF('Tex-501-C'!$B$172=\"\",\"\",'Tex-501-C'!$B$172)","v":"Tex-515-C : Distillation of Cutback Asphaltic (Bituminous) Products"},{"$f":"IF('Tex-501-C'!$E$198=\"\",\"\",'Tex-501-C'!$E$198)","v":"Actual sample volume, ml:"}]
[145,{"$f":"IF('Tex-501-C'!$F$202=\"\",\"\",'Tex-501-C'!$F$202)","v":""},{"$f":"IF('Tex-501-C'!$B$200=\"\",\"\",'Tex-501-C'!$B$200)","v":"Tex-519-C : Float Test for Bituminous Materials"},{"$f":"IF('Tex-501-C'!$E$202=\"\",\"\",'Tex-501-C'!$E$202)","v":"Float at º , seconds"}]
[146,{"$f":"IF('Tex-501-C'!$F$204=\"\",\"\",'Tex-501-C'!$F$204)","v":""},{"$f":"IF('Tex-501-C'!$B$200=\"\",\"\",'Tex-501-C'!$B$200)","v":"Tex-519-C : Float Test for Bituminous Materials"},{"$f":"IF('Tex-501-C'!$F$179=\"\",\"\",'Tex-501-C'!$F$179)","v":"Total Distillate"},{"$f":"IF('Tex-501-C'!$D$204=\"\",\"\",'Tex-501-C'!$D$204)","v":"Temperature"},{"$f":"IF('Tex-501-C'!$E$204=\"\",\"\",'Tex-501-C'!$E$204)","v":""}]
[147,{"$f":"IF('Tex-501-C'!$G$208=\"\",\"\",'Tex-501-C'!$G$208)","v":""},{"$f":"IF('Tex-501-C'!$B$206=\"\",\"\",'Tex-501-C'!$B$206)","v":"Tex-520-C : Residue of Specified Penetration"},{"$f":"IF('Tex-501-C'!$F$208=\"\",\"\",'Tex-501-C'!$F$208)","v":"Interpolation Between Percentages of the Two Residues, g:"}]
[148,{"$f":"IF('Tex-501-C'!$F$210=\"\",\"\",'Tex-501-C'!$F$210)","v":""},{"$f":"IF('Tex-501-C'!$B$206=\"\",\"\",'Tex-501-C'!$B$206)","v":"Tex-520-C : Residue of Specified Penetration"},{"$f":"IF('Tex-501-C'!$E$210=\"\",\"\",'Tex-501-C'!$E$210)","v":"Target Penetration, dmm:"}]
[149,{"$f":"IF('Tex-501-C'!$F$212=\"\",\"\",'Tex-501-C'!$F$212)","v":""},{"$f":"IF('Tex-501-C'!$B$206=\"\",\"\",'Tex-501-C'!$B$206)","v":"Tex-520-C : Residue of Specified Penetration"},{"$f":"IF('Tex-501-C'!$E$212=\"\",\"\",'Tex-501-C'!$E$212)","v":"First, Weight of Residue, g:"}]
[150,{"$f":"IF('Tex-501-C'!$F$213=\"\",\"\",'Tex-501-C'!$F$213)","v":""},{"$f":"IF('Tex-501-C'!$B$206=\"\",\"\",'Tex-501-C'!$B$206)","v":"Tex-520-C : Residue of Specified Penetration"},{"$f":"IF('Tex-501-C'!$E$213=\"\",\"\",'Tex-501-C'!$E$213)","v":"Penetration at ºF, dmm:"}]
[151,{"$f":"IF('Tex-501-C'!$F$214=\"\",\"\",'Tex-501-C'!$F$214)","v":""},{"$f":"IF('Tex-501-C'!$B$206=\"\",\"\",'Tex-501-C'!$B$206)","v":"Tex-520-C : Residue of Specified Penetration"},{"$f":"IF('Tex-501-C'!$E$214=\"\",\"\",'Tex-501-C'!$E$214)","v":"Temperature, °F"}]
[152,{"$f":"IF('Tex-501-C'!$F$216=\"\",\"\",'Tex-501-C'!$F$216)","v":""},{"$f":"IF('Tex-501-C'!$B$206=\"\",\"\",'Tex-501-C'!$B$206)","v":"Tex-520-C : Residue of Specified Penetration"},{"$f":"IF('Tex-501-C'!$E$216=\"\",\"\",'Tex-501-C'!$E$216)","v":"Second, Weight of Residue, g:"}]
[153,{"$f":"IF('Tex-501-C'!$F$217=\"\",\"\",'Tex-501-C'!$F$217)","v":""},{"$f":"IF('Tex-501-C'!$B$206=\"\",\"\",'Tex-501-C'!$B$206)","v":"Tex-520-C : Residue of Specified Penetration"},{"$f":"IF('Tex-501-C'!$E$217=\"\",\"\",'Tex-501-C'!$E$217)","v":"Penetration at ºF, dmm:"}]
[154,{"$f":"IF('Tex-501-C'!$F$218=\"\",\"\",'Tex-501-C'!$F$218)","v":""},{"$f":"IF('Tex-501-C'!$B$206=\"\",\"\",'Tex-501-C'!$B$206)","v":"Tex-520-C : Residue of Specified Penetration"},{"$f":"IF('Tex-501-C'!$E$218=\"\",\"\",'Tex-501-C'!$E$218)","v":"Temperature, °F"}]
[155,{"$f":"IF('Tex-501-C'!$H$222=\"\",\"\",'Tex-501-C'!$H$222)","v":""},{"$f":"IF('Tex-501-C'!$B$220=\"\",\"\",'Tex-501-C'!$B$220)","v":"Tex-521-C : Testing Emulsified Asphalts"},{"$f":"IF('Tex-501-C'!$G$222=\"\",\"\",'Tex-501-C'!$G$222)","v":"Percent Residue After Distillation, %:"}]
[156,{"$f":"IF('Tex-501-C'!$G$224=\"\",\"\",'Tex-501-C'!$G$224)","v":""},{"$f":"IF('Tex-501-C'!$B$220=\"\",\"\",'Tex-501-C'!$B$220)","v":"Tex-521-C : Testing Emulsified Asphalts"},{"$f":"IF('Tex-501-C'!$F$224=\"\",\"\",'Tex-501-C'!$F$224)","v":"Weight of Cold Still & Thermometer, g:"}]
[157,{"$f":"IF('Tex-501-C'!$G$225=\"\",\"\",'Tex-501-C'!$G$225)","v":""},{"$f":"IF('Tex-501-C'!$B$220=\"\",\"\",'Tex-501-C'!$B$220)","v":"Tex-521-C : Testing Emulsified Asphalts"},{"$f":"IF('Tex-501-C'!$F$225=\"\",\"\",'Tex-501-C'!$F$225)","v":"Weight of Sample (charge), g:"}]
[158,{"$f":"IF('Tex-501-C'!$G$227=\"\",\"\",'Tex-501-C'!$G$227)","v":""},{"$f":"IF('Tex-501-C'!$B$220=\"\",\"\",'Tex-501-C'!$B$220)","v":"Tex-521-C : Testing Emulsified Asphalts"},{"$f":"IF('Tex-501-C'!$F$227=\"\",\"\",'Tex-501-C'!$F$227)","v":"Weight of Residue, Still & Thermometer, g:"}]
[159,{"$f":"IF('Tex-501-C'!$G$228=\"\",\"\",'Tex-501-C'!$G$228)","v":""},{"$f":"IF('Tex-501-C'!$B$220=\"\",\"\",'Tex-501-C'!$B$220)","v":"Tex-521-C : Testing Emulsified Asphalts"},{"$f":"IF('Tex-501-C'!$F$228=\"\",\"\",'Tex-501-C'!$F$228)","v":"+ 1.5g Adjustment for Still Weight at 500º F, g:"}]
[160,{"$f":"IF('Tex-501-C'!$G$230=\"\",\"\",'Tex-501-C'!$G$230)","v":""},{"$f":"IF('Tex-501-C'!$B$220=\"\",\"\",'Tex-501-C'!$B$220)","v":"Tex-521-C : Testing Emulsified Asphalts"},{"$f":"IF('Tex-501-C'!$F$230=\"\",\"\",'Tex-501-C'!$F$230)","v":"Residue After Distillation, g:"}]
[161,{"$f":"IF('Tex-501-C'!$H$232=\"\",\"\",'Tex-501-C'!$H$232)","v":""},{"$f":"IF('Tex-501-C'!$B$220=\"\",\"\",'Tex-501-C'!$B$220)","v":"Tex-521-C : Testing Emulsified Asphalts"},{"$f":"IF('Tex-501-C'!$G$232=\"\",\"\",'Tex-501-C'!$G$232)","v":"Percent Residue After Evaporation, %:"}]
[162,{"$f":"IF('Tex-501-C'!$F$235=\"\",\"\",'Tex-501-C'!$F$235)","v":""},{"$f":"IF('Tex-501-C'!$B$220=\"\",\"\",'Tex-501-C'!$B$220)","v":"Tex-521-C : Testing Emulsified Asphalts"},{"$f":"IF('Tex-501-C'!$C$234=\"\",\"\",'Tex-501-C'!$C$234)","v":"Original:"},{"$f":"IF('Tex-501-C'!$C$235=\"\",\"\",'Tex-501-C'!$C$235)","v":"Weight of Beaker & Rod, g:"},{"$f":"IF('Tex-501-C'!$F$234=\"\",\"\",'Tex-501-C'!$F$234)","v":"A"}]
[163,{"$f":"IF('Tex-501-C'!$G$235=\"\",\"\",'Tex-501-C'!$G$235)","v":""},{"$f":"IF('Tex-501-C'!$B$220=\"\",\"\",'Tex-501-C'!$B$220)","v":"Tex-521-C : Testing Emulsified Asphalts"},{"$f":"IF('Tex-501-C'!$C$234=\"\",\"\",'Tex-501-C'!$C$234)","v":"Original:"},{"$f":"IF('Tex-501-C'!$C$235=\"\",\"\",'Tex-501-C'!$C$235)","v":"Weight of Beaker & Rod, g:"},{"$f":"IF('Tex-501-C'!$G$234=\"\",\"\",'Tex-501-C'!$G$234)","v":"B"}]
[164,{"$f":"IF('Tex-501-C'!$H$235=\"\",\"\",'Tex-501-C'!$H$235)","v":""},{"$f":"IF('Tex-501-C'!$B$220=\"\",\"\",'Tex-501-C'!$B$220)","v":"Tex-521-C : Testing Emulsified Asphalts"},{"$f":"IF('Tex-501-C'!$C$234=\"\",\"\",'Tex-501-C'!$C$234)","v":"Original:"},{"$f":"IF('Tex-501-C'!$C$235=\"\",\"\",'Tex-501-C'!$C$235)","v":"Weight of Beaker & Rod, g:"},{"$f":"IF('Tex-501-C'!$H$234=\"\",\"\",'Tex-501-C'!$H$234)","v":"C"}]
[165,{"$f":"IF('Tex-501-C'!$F$236=\"\",\"\",'Tex-501-C'!$F$236)","v":""},{"$f":"IF('Tex-501-C'!$B$220=\"\",\"\",'Tex-501-C'!$B$220)","v":"Tex-521-C : Testing Emulsified Asphalts"},{"$f":"IF('Tex-501-C'!$C$234=\"\",\"\",'Tex-501-C'!$C$234)","v":"Original:"},{"$f":"IF('Tex-501-C'!$C$236=\"\",\"\",'Tex-501-C'!$C$236)","v":"Weight of Sample (charge), g:"},{"$f":"IF('Tex-501-C'!$F$234=\"\",\"\",'Tex-501-C'!$F$234)","v":"A"}]
[166,{"$f":"IF('Tex-501-C'!$G$236=\"\",\"\",'Tex-501-C'!$G$236)","v":""},{"$f":"IF('Tex-501-C'!$B$220=\"\",\"\",'Tex-501-C'!$B$220)","v":"Tex-521-C : Testing Emulsified Asphalts"},{"$f":"IF('Tex-501-C'!$C$234=\"\",\"\",'Tex-501-C'!$C$234)","v":"Original:"},{"$f":"IF('Tex-501-C'!$C$236=\"\",\"\",'Tex-501-C'!$C$236)","v":"Weight of Sample (charge), g:"},{"$f":"IF('Tex-501-C'!$G$234=\"\",\"\",'Tex-501-C'!$G$234)","v":"B"}]
[167,{"$f":"IF('Tex-501-C'!$H$236=\"\",\"\",'Tex-501-C'!$H$236)","v":""},{"$f":"IF('Tex-501-C'!$B$220=\"\",\"\",'Tex-501-C'!$B$220)","v":"Tex-521-C : Testing Emulsified Asphalts"},{"$f":"IF('Tex-501-C'!$C$234=\"\",\"\",'Tex-501-C'!$C$234)","v":"Original:"},{"$f":"IF('Tex-501-C'!$C$236=\"\",\"\",'Tex-501-C'!$C$236)","v":"Weight of Sample (charge), g:"},{"$f":"IF('Tex-501-C'!$H$234=\"\",\"\",'Tex-501-C'!$H$234)","v":"C"}]
[168,{"$f":"IF('Tex-501-C'!$F$238=\"\",\"\",'Tex-501-C'!$F$238)","v":""},{"$f":"IF('Tex-501-C'!$B$220=\"\",\"\",'Tex-501-C'!$B$220)","v":"Tex-521-C : Testing Emulsified Asphalts"},{"$f":"IF('Tex-501-C'!$C$237=\"\",\"\",'Tex-501-C'!$C$237)","v":"After Evaporation:"},{"$f":"IF('Tex-501-C'!$C$238=\"\",\"\",'Tex-501-C'!$C$238)","v":"Weight of Beaker, Rod & Residue, g:"},{"$f":"IF('Tex-501-C'!$F$234=\"\",\"\",'Tex-501-C'!$F$234)","v":"A"}]
[169,{"$f":"IF('Tex-501-C'!$G$238=\"\",\"\",'Tex-501-C'!$G$238)","v":""},{"$f":"IF('Tex-501-C'!$B$220=\"\",\"\",'Tex-501-C'!$B$220)","v":"Tex-521-C : Testing Emulsified Asphalts"},{"$f":"IF('Tex-501-C'!$C$237=\"\",\"\",'Tex-501-C'!$C$237)","v":"After Evaporation:"},{"$f":"IF('Tex-501-C'!$C$238=\"\",\"\",'Tex-501-C'!$C$238)","v":"Weight of Beaker, Rod & Residue, g:"},{"$f":"IF('Tex-501-C'!$G$234=\"\",\"\",'Tex-501-C'!$G$234)","v":"B"}]
[170,{"$f":"IF('Tex-501-C'!$H$238=\"\",\"\",'Tex-501-C'!$H$238)","v":""},{"$f":"IF('Tex-501-C'!$B$220=\"\",\"\",'Tex-501-C'!$B$220)","v":"Tex-521-C : Testing Emulsified Asphalts"},{"$f":"IF('Tex-501-C'!$C$237=\"\",\"\",'Tex-501-C'!$C$237)","v":"After Evaporation:"},{"$f":"IF('Tex-501-C'!$C$238=\"\",\"\",'Tex-501-C'!$C$238)","v":"Weight of Beaker, Rod & Residue, g:"},{"$f":"IF('Tex-501-C'!$H$234=\"\",\"\",'Tex-501-C'!$H$234)","v":"C"}]
[171,{"$f":"IF('Tex-501-C'!$F$239=\"\",\"\",'Tex-501-C'!$F$239)","v":""},{"$f":"IF('Tex-501-C'!$B$220=\"\",\"\",'Tex-501-C'!$B$220)","v":"Tex-521-C : Testing Emulsified Asphalts"},{"$f":"IF('Tex-501-C'!$C$237=\"\",\"\",'Tex-501-C'!$C$237)","v":"After Evaporation:"},{"$f":"IF('Tex-501-C'!$C$239=\"\",\"\",'Tex-501-C'!$C$239)","v":"Weight of Residue, g:"},{"$f":"IF('Tex-501-C'!$F$234=\"\",\"\",'Tex-501-C'!$F$234)","v":"A"}]
[172,{"$f":"IF('Tex-501-C'!$G$239=\"\",\"\",'Tex-501-C'!$G$239)","v":""},{"$f":"IF('Tex-501-C'!$B$220=\"\",\"\",'Tex-501-C'!$B$220)","v":"Tex-521-C : Testing Emulsified Asphalts"},{"$f":"IF('Tex-501-C'!$C$237=\"\",\"\",'Tex-501-C'!$C$237)","v":"After Evaporation:"},{"$f":"IF('Tex-501-C'!$C$239=\"\",\"\",'Tex-501-C'!$C$239)","v":"Weight of Residue, g:"},{"$f":"IF('Tex-501-C'!$G$234=\"\",\"\",'Tex-501-C'!$G$234)","v":"B"}]
[173,{"$f":"IF('Tex-501-C'!$H$239=\"\",\"\",'Tex-501-C'!$H$239)","v":""},{"$f":"IF('Tex-501-C'!$B$220=\"\",\"\",'Tex-501-C'!$B$220)","v":"Tex-521-C : Testing Emulsified Asphalts"},{"$f":"IF('Tex-501-C'!$C$237=\"\",\"\",'Tex-501-C'!$C$237)","v":"After Evaporation:"},{"$f":"IF('Tex-501-C'!$C$239=\"\",\"\",'Tex-501-C'!$C$239)","v":"Weight of Residue, g:"},{"$f":"IF('Tex-501-C'!$H$234=\"\",\"\",'Tex-501-C'!$H$234)","v":"C"}]
[174,{"$f":"IF('Tex-501-C'!$F$240=\"\",\"\",'Tex-501-C'!$F$240)","v":""},{"$f":"IF('Tex-501-C'!$B$220=\"\",\"\",'Tex-501-C'!$B$220)","v":"Tex-521-C : Testing Emulsified Asphalts"},{"$f":"IF('Tex-501-C'!$C$237=\"\",\"\",'Tex-501-C'!$C$237)","v":"After Evaporation:"},{"$f":"IF('Tex-501-C'!$E$240=\"\",\"\",'Tex-501-C'!$E$240)","v":""},{"$f":"IF('Tex-501-C'!$F$234=\"\",\"\",'Tex-501-C'!$F$234)","v":"A"}]
[175,{"$f":"IF('Tex-501-C'!$G$240=\"\",\"\",'Tex-501-C'!$G$240)","v":""},{"$f":"IF('Tex-501-C'!$B$220=\"\",\"\",'Tex-501-C'!$B$220)","v":"Tex-521-C : Testing Emulsified Asphalts"},{"$f":"IF('Tex-501-C'!$C$237=\"\",\"\",'Tex-501-C'!$C$237)","v":"After Evaporation:"},{"$f":"IF('Tex-501-C'!$E$240=\"\",\"\",'Tex-501-C'!$E$240)","v":""},{"$f":"IF('Tex-501-C'!$G$234=\"\",\"\",'Tex-501-C'!$G$234)","v":"B"}]
[176,{"$f":"IF('Tex-501-C'!$H$240=\"\",\"\",'Tex-501-C'!$H$240)","v":""},{"$f":"IF('Tex-501-C'!$B$220=\"\",\"\",'Tex-501-C'!$B$220)","v":"Tex-521-C : Testing Emulsified Asphalts"},{"$f":"IF('Tex-501-C'!$C$237=\"\",\"\",'Tex-501-C'!$C$237)","v":"After Evaporation:"},{"$f":"IF('Tex-501-C'!$E$240=\"\",\"\",'Tex-501-C'!$E$240)","v":""},{"$f":"IF('Tex-501-C'!$H$234=\"\",\"\",'Tex-501-C'!$H$234)","v":"C"}]
[177,{"$f":"IF('Tex-501-C'!$H$242=\"\",\"\",'Tex-501-C'!$H$242)","v":""},{"$f":"IF('Tex-501-C'!$B$220=\"\",\"\",'Tex-501-C'!$B$220)","v":"Tex-521-C : Testing Emulsified Asphalts"},{"$f":"IF('Tex-501-C'!$G$242=\"\",\"\",'Tex-501-C'!$G$242)","v":"Average"}]
[178,{"$f":"IF('Tex-501-C'!$G$244=\"\",\"\",'Tex-501-C'!$G$244)","v":""},{"$f":"IF('Tex-501-C'!$B$220=\"\",\"\",'Tex-501-C'!$B$220)","v":"Tex-521-C : Testing Emulsified Asphalts"},{"$f":"IF('Tex-501-C'!$F$244=\"\",\"\",'Tex-501-C'!$F$244)","v":"Percent Demulsibility, %:"}]
[179,{"$f":"IF('Tex-501-C'!$G$246=\"\",\"\",'Tex-501-C'!$G$246)","v":""},{"$f":"IF('Tex-501-C'!$B$220=\"\",\"\",'Tex-501-C'!$B$220)","v":"Tex-521-C : Testing Emulsified Asphalts"},{"$f":"IF('Tex-501-C'!$F$246=\"\",\"\",'Tex-501-C'!$F$246)","v":"Weight of Beaker,Cloth & Rod, g:"}]
[180,{"$f":"IF('Tex-501-C'!$G$247=\"\",\"\",'Tex-501-C'!$G$247)","v":""},{"$f":"IF('Tex-501-C'!$B$220=\"\",\"\",'Tex-501-C'!$B$220)","v":"Tex-521-C : Testing Emulsified Asphalts"},{"$f":"IF('Tex-501-C'!$F$247=\"\",\"\",'Tex-501-C'!$F$247)","v":"Weight of Sample, g:"}]
[181,{"$f":"IF('Tex-501-C'!$G$248=\"\",\"\",'Tex-501-C'!$G$248)","v":""},{"$f":"IF('Tex-501-C'!$B$220=\"\",\"\",'Tex-501-C'!$B$220)","v":"Tex-521-C : Testing Emulsified Asphalts"},{"$f":"IF('Tex-501-C'!$F$248=\"\",\"\",'Tex-501-C'!$F$248)","v":"Weight of Sample,Beaker,Cloth & Rod (after drying), g:"}]
[182,{"$f":"IF('Tex-501-C'!$G$249=\"\",\"\",'Tex-501-C'!$G$249)","v":""},{"$f":"IF('Tex-501-C'!$B$220=\"\",\"\",'Tex-501-C'!$B$220)","v":"Tex-521-C : Testing Emulsified Asphalts"},{"$f":"IF('Tex-501-C'!$F$249=\"\",\"\",'Tex-501-C'!$F$249)","v":"Percent of Orginal Sample Retained, %:"}]
[183,{"$f":"IF('Tex-501-C'!$G$250=\"\",\"\",'Tex-501-C'!$G$250)","v":""},{"$f":"IF('Tex-501-C'!$B$220=\"\",\"\",'Tex-501-C'!$B$220)","v":"Tex-521-C : Testing Emulsified Asphalts"},{"$f":"IF('Tex-501-C'!$F$250=\"\",\"\",'Tex-501-C'!$F$250)","v":"% Residue from Distillation, %:"}]
[184,{"$f":"IF('Tex-501-C'!$G$252=\"\",\"\",'Tex-501-C'!$G$252)","v":""},{"$f":"IF('Tex-501-C'!$B$220=\"\",\"\",'Tex-501-C'!$B$220)","v":"Tex-521-C : Testing Emulsified Asphalts"},{"$f":"IF('Tex-501-C'!$F$252=\"\",\"\",'Tex-501-C'!$F$252)","v":"Settlement After 5 Days, %:"}]
[185,{"$f":"IF('Tex-501-C'!$E$256=\"\",\"\",'Tex-501-C'!$E$256)","v":""},{"$f":"IF('Tex-501-C'!$B$220=\"\",\"\",'Tex-501-C'!$B$220)","v":"Tex-521-C : Testing Emulsified Asphalts"},{"$f":"IF('Tex-501-C'!$D$256=\"\",\"\",'Tex-501-C'!$D$256)","v":"Weight of Beaker & Rod, g:"},{"$f":"IF('Tex-501-C'!$E$254=\"\",\"\",'Tex-501-C'!$E$254)","v":"Top"}]
[186,{"$f":"IF('Tex-501-C'!$F$256=\"\",\"\",'Tex-501-C'!$F$256)","v":""},{"$f":"IF('Tex-501-C'!$B$220=\"\",\"\",'Tex-501-C'!$B$220)","v":"Tex-521-C : Testing Emulsified Asphalts"},{"$f":"IF('Tex-501-C'!$D$256=\"\",\"\",'Tex-501-C'!$D$256)","v":"Weight of Beaker & Rod, g:"},{"$f":"IF('Tex-501-C'!$E$254=\"\",\"\",'Tex-501-C'!$E$254)","v":"Top"}]
[187,{"$f":"IF('Tex-501-C'!$G$256=\"\",\"\",'Tex-501-C'!$G$256)","v":""},{"$f":"IF('Tex-501-C'!$B$220=\"\",\"\",'Tex-501-C'!$B$220)","v":"Tex-521-C : Testing Emulsified Asphalts"},{"$f":"IF('Tex-501-C'!$D$256=\"\",\"\",'Tex-501-C'!$D$256)","v":"Weight of Beaker & Rod, g:"},{"$f":"IF('Tex-501-C'!$G$254=\"\",\"\",'Tex-501-C'!$G$254)","v":"Bottom"}]
[188,{"$f":"IF('Tex-501-C'!$H$256=\"\",\"\",'Tex-501-C'!$H$256)","v":""},{"$f":"IF('Tex-501-C'!$B$220=\"\",\"\",'Tex-501-C'!$B$220)","v":"Tex-521-C : Testing Emulsified Asphalts"},{"$f":"IF('Tex-501-C'!$D$256=\"\",\"\",'Tex-501-C'!$D$256)","v":"Weight of Beaker & Rod, g:"},{"$f":"IF('Tex-501-C'!$G$254=\"\",\"\",'Tex-501-C'!$G$254)","v":"Bottom"}]
[189,{"$f":"IF('Tex-501-C'!$E$257=\"\",\"\",'Tex-501-C'!$E$257)","v":""},{"$f":"IF('Tex-501-C'!$B$220=\"\",\"\",'Tex-501-C'!$B$220)","v":"Tex-521-C : Testing Emulsified Asphalts"},{"$f":"IF('Tex-501-C'!$D$257=\"\",\"\",'Tex-501-C'!$D$257)","v":"Weight of Sample (charge), g:"},{"$f":"IF('Tex-501-C'!$E$254=\"\",\"\",'Tex-501-C'!$E$254)","v":"Top"}]
[190,{"$f":"IF('Tex-501-C'!$F$257=\"\",\"\",'Tex-501-C'!$F$257)","v":""},{"$f":"IF('Tex-501-C'!$B$220=\"\",\"\",'Tex-501-C'!$B$220)","v":"Tex-521-C : Testing Emulsified Asphalts"},{"$f":"IF('Tex-501-C'!$D$257=\"\",\"\",'Tex-501-C'!$D$257)","v":"Weight of Sample (charge), g:"},{"$f":"IF('Tex-501-C'!$E$254=\"\",\"\",'Tex-501-C'!$E$254)","v":"Top"}]
[191,{"$f":"IF('Tex-501-C'!$G$257=\"\",\"\",'Tex-501-C'!$G$257)","v":""},{"$f":"IF('Tex-501-C'!$B$220=\"\",\"\",'Tex-501-C'!$B$220)","v":"Tex-521-C : Testing Emulsified Asphalts"},{"$f":"IF('Tex-501-C'!$D$257=\"\",\"\",'Tex-501-C'!$D$257)","v":"Weight of Sample (charge), g:"},{"$f":"IF('Tex-501-C'!$G$254=\"\",\"\",'Tex-501-C'!$G$254)","v":"Bottom"}]
[192,{"$f":"IF('Tex-501-C'!$H$257=\"\",\"\",'Tex-501-C'!$H$257)","v":""},{"$f":"IF('Tex-501-C'!$B$220=\"\",\"\",'Tex-501-C'!$B$220)","v":"Tex-521-C : Testing Emulsified Asphalts"},{"$f":"IF('Tex-501-C'!$D$257=\"\",\"\",'Tex-501-C'!$D$257)","v":"Weight of Sample (charge), g:"},{"$f":"IF('Tex-501-C'!$G$254=\"\",\"\",'Tex-501-C'!$G$254)","v":"Bottom"}]
[193,{"$f":"IF('Tex-501-C'!$E$259=\"\",\"\",'Tex-501-C'!$E$259)","v":""},{"$f":"IF('Tex-501-C'!$B$220=\"\",\"\",'Tex-501-C'!$B$220)","v":"Tex-521-C : Testing Emulsified Asphalts"},{"$f":"IF('Tex-501-C'!$D$259=\"\",\"\",'Tex-501-C'!$D$259)","v":"Weight of Beaker, Rod & Residue, g:"},{"$f":"IF('Tex-501-C'!$E$254=\"\",\"\",'Tex-501-C'!$E$254)","v":"Top"}]
[194,{"$f":"IF('Tex-501-C'!$F$259=\"\",\"\",'Tex-501-C'!$F$259)","v":""},{"$f":"IF('Tex-501-C'!$B$220=\"\",\"\",'Tex-501-C'!$B$220)","v":"Tex-521-C : Testing Emulsified Asphalts"},{"$f":"IF('Tex-501-C'!$D$259=\"\",\"\",'Tex-501-C'!$D$259)","v":"Weight of Beaker, Rod & Residue, g:"},{"$f":"IF('Tex-501-C'!$E$254=\"\",\"\",'Tex-501-C'!$E$254)","v":"Top"}]
[195,{"$f":"IF('Tex-501-C'!$G$259=\"\",\"\",'Tex-501-C'!$G$259)","v":""},{"$f":"IF('Tex-501-C'!$B$220=\"\",\"\",'Tex-501-C'!$B$220)","v":"Tex-521-C : Testing Emulsified Asphalts"},{"$f":"IF('Tex-501-C'!$D$259=\"\",\"\",'Tex-501-C'!$D$259)","v":"Weight of Beaker, Rod & Residue, g:"},{"$f":"IF('Tex-501-C'!$G$254=\"\",\"\",'Tex-501-C'!$G$254)","v":"Bottom"}]
[196,{"$f":"IF('Tex-501-C'!$H$259=\"\",\"\",'Tex-501-C'!$H$259)","v":""},{"$f":"IF('Tex-501-C'!$B$220=\"\",\"\",'Tex-501-C'!$B$220)","v":"Tex-521-C : Testing Emulsified Asphalts"},{"$f":"IF('Tex-501-C'!$D$259=\"\",\"\",'Tex-501-C'!$D$259)","v":"Weight of Beaker, Rod & Residue, g:"},{"$f":"IF('Tex-501-C'!$G$254=\"\",\"\",'Tex-501-C'!$G$254)","v":"Bottom"}]
[197,{"$f":"IF('Tex-501-C'!$E$260=\"\",\"\",'Tex-501-C'!$E$260)","v":""},{"$f":"IF('Tex-501-C'!$B$220=\"\",\"\",'Tex-501-C'!$B$220)","v":"Tex-521-C : Testing Emulsified Asphalts"},{"$f":"IF('Tex-501-C'!$D$260=\"\",\"\",'Tex-501-C'!$D$260)","v":"Weight of Residue, g:"},{"$f":"IF('Tex-501-C'!$E$254=\"\",\"\",'Tex-501-C'!$E$254)","v":"Top"}]
[198,{"$f":"IF('Tex-501-C'!$F$260=\"\",\"\",'Tex-501-C'!$F$260)","v":""},{"$f":"IF('Tex-501-C'!$B$220=\"\",\"\",'Tex-501-C'!$B$220)","v":"Tex-521-C : Testing Emulsified Asphalts"},{"$f":"IF('Tex-501-C'!$D$260=\"\",\"\",'Tex-501-C'!$D$260)","v":"Weight of Residue, g:"},{"$f":"IF('Tex-501-C'!$E$254=\"\",\"\",'Tex-501-C'!$E$254)","v":"Top"}]
[199,{"$f":"IF('Tex-501-C'!$G$260=\"\",\"\",'Tex-501-C'!$G$260)","v":""},{"$f":"IF('Tex-501-C'!$B$220=\"\",\"\",'Tex-501-C'!$B$220)","v":"Tex-521-C : Testing Emulsified Asphalts"},{"$f":"IF('Tex-501-C'!$D$260=\"\",\"\",'Tex-501-C'!$D$260)","v":"Weight of Residue, g:"},{"$f":"IF('Tex-501-C'!$G$254=\"\",\"\",'Tex-501-C'!$G$254)","v":"Bottom"}]
[200,{"$f":"IF('Tex-501-C'!$H$260=\"\",\"\",'Tex-501-C'!$H$260)","v":""},{"$f":"IF('Tex-501-C'!$B$220=\"\",\"\",'Tex-501-C'!$B$220)","v":"Tex-521-C : Testing Emulsified Asphalts"},{"$f":"IF('Tex-501-C'!$D$260=\"\",\"\",'Tex-501-C'!$D$260)","v":"Weight of Residue, g:"},{"$f":"IF('Tex-501-C'!$G$254=\"\",\"\",'Tex-501-C'!$G$254)","v":"Bottom"}]
[201,{"$f":"IF('Tex-501-C'!$E$262=\"\",\"\",'Tex-501-C'!$E$262)","v":""},{"$f":"IF('Tex-501-C'!$B$220=\"\",\"\",'Tex-501-C'!$B$220)","v":"Tex-521-C : Testing Emulsified Asphalts"},{"$f":"IF('Tex-501-C'!$D$262=\"\",\"\",'Tex-501-C'!$D$262)","v":"% Residue"},{"$f":"IF('Tex-501-C'!$E$254=\"\",\"\",'Tex-501-C'!$E$254)","v":"Top"}]
[202,{"$f":"IF('Tex-501-C'!$F$262=\"\",\"\",'Tex-501-C'!$F$262)","v":""},{"$f":"IF('Tex-501-C'!$B$220=\"\",\"\",'Tex-501-C'!$B$220)","v":"Tex-521-C : Testing Emulsified Asphalts"},{"$f":"IF('Tex-501-C'!$D$262=\"\",\"\",'Tex-501-C'!$D$262)","v":"% Residue"},{"$f":"IF('Tex-501-C'!$E$254=\"\",\"\",'Tex-501-C'!$E$254)","v":"Top"}]
[203,{"$f":"IF('Tex-501-C'!$G$262=\"\",\"\",'Tex-501-C'!$G$262)","v":""},{"$f":"IF('Tex-501-C'!$B$220=\"\",\"\",'Tex-501-C'!$B$220)","v":"Tex-521-C : Testing Emulsified Asphalts"},{"$f":"IF('Tex-501-C'!$D$262=\"\",\"\",'Tex-501-C'!$D$262)","v":"% Residue"},{"$f":"IF('Tex-501-C'!$G$254=\"\",\"\",'Tex-501-C'!$G$254)","v":"Bottom"}]
[204,{"$f":"IF('Tex-501-C'!$H$262=\"\",\"\",'Tex-501-C'!$H$262)","v":""},{"$f":"IF('Tex-501-C'!$B$220=\"\",\"\",'Tex-501-C'!$B$220)","v":"Tex-521-C : Testing Emulsified Asphalts"},{"$f":"IF('Tex-501-C'!$D$262=\"\",\"\",'Tex-501-C'!$D$262)","v":"% Residue"},{"$f":"IF('Tex-501-C'!$G$254=\"\",\"\",'Tex-501-C'!$G$254)","v":"Bottom"}]
[205,{"$f":"IF('Tex-501-C'!$F$264=\"\",\"\",'Tex-501-C'!$F$264)","v":""},{"$f":"IF('Tex-501-C'!$B$220=\"\",\"\",'Tex-501-C'!$B$220)","v":"Tex-521-C : Testing Emulsified Asphalts"},{"$f":"IF('Tex-501-C'!$E$264=\"\",\"\",'Tex-501-C'!$E$264)","v":"Average % Residue"},{"$f":"IF('Tex-501-C'!$E$254=\"\",\"\",'Tex-501-C'!$E$254)","v":"Top"}]
[206,{"$f":"IF('Tex-501-C'!$H$264=\"\",\"\",'Tex-501-C'!$H$264)","v":""},{"$f":"IF('Tex-501-C'!$B$220=\"\",\"\",'Tex-501-C'!$B$220)","v":"Tex-521-C : Testing Emulsified Asphalts"},{"$f":"IF('Tex-501-C'!$E$264=\"\",\"\",'Tex-501-C'!$E$264)","v":"Average % Residue"},{"$f":"IF('Tex-501-C'!$G$254=\"\",\"\",'Tex-501-C'!$G$254)","v":"Bottom"}]
[207,{"$f":"IF('Tex-501-C'!$G$266=\"\",\"\",'Tex-501-C'!$G$266)","v":""},{"$f":"IF('Tex-501-C'!$B$220=\"\",\"\",'Tex-501-C'!$B$220)","v":"Tex-521-C : Testing Emulsified Asphalts"},{"$f":"IF('Tex-501-C'!$F$266=\"\",\"\",'Tex-501-C'!$F$266)","v":"Percentage of Break"}]
[208,{"$f":"IF('Tex-501-C'!$G$268=\"\",\"\",'Tex-501-C'!$G$268)","v":""},{"$f":"IF('Tex-501-C'!$B$220=\"\",\"\",'Tex-501-C'!$B$220)","v":"Tex-521-C : Testing Emulsified Asphalts"},{"$f":"IF('Tex-501-C'!$F$268=\"\",\"\",'Tex-501-C'!$F$268)","v":"% Residue from Distillation "}]
[209,{"$f":"IF('Tex-501-C'!$G$269=\"\",\"\",'Tex-501-C'!$G$269)","v":""},{"$f":"IF('Tex-501-C'!$B$220=\"\",\"\",'Tex-501-C'!$B$220)","v":"Tex-521-C : Testing Emulsified Asphalts"},{"$f":"IF('Tex-501-C'!$F$269=\"\",\"\",'Tex-501-C'!$F$269)","v":"Use to Dilute to 55% Residue, ml"}]
[210,{"$f":"IF('Tex-501-C'!$G$271=\"\",\"\",'Tex-501-C'!$G$271)","v":""},{"$f":"IF('Tex-501-C'!$B$220=\"\",\"\",'Tex-501-C'!$B$220)","v":"Tex-521-C : Testing Emulsified Asphalts"},{"$f":"IF('Tex-501-C'!$F$271=\"\",\"\",'Tex-501-C'!$F$271)","v":"Weight of # 14 Sieve & Pan, g:"}]
[211,{"$f":"IF('Tex-501-C'!$G$272=\"\",\"\",'Tex-501-C'!$G$272)","v":""},{"$f":"IF('Tex-501-C'!$B$220=\"\",\"\",'Tex-501-C'!$B$220)","v":"Tex-521-C : Testing Emulsified Asphalts"},{"$f":"IF('Tex-501-C'!$F$272=\"\",\"\",'Tex-501-C'!$F$272)","v":"Weight of # 14 Sieve, Pan & Residue, g:"}]
[212,{"$f":"IF('Tex-501-C'!$H$274=\"\",\"\",'Tex-501-C'!$H$274)","v":""},{"$f":"IF('Tex-501-C'!$B$220=\"\",\"\",'Tex-501-C'!$B$220)","v":"Tex-521-C : Testing Emulsified Asphalts"},{"$f":"IF('Tex-501-C'!$G$274=\"\",\"\",'Tex-501-C'!$G$274)","v":"Percentage of Sample Retained, %:"}]
[213,{"$f":"IF('Tex-501-C'!$H$276=\"\",\"\",'Tex-501-C'!$H$276)","v":""},{"$f":"IF('Tex-501-C'!$B$220=\"\",\"\",'Tex-501-C'!$B$220)","v":"Tex-521-C : Testing Emulsified Asphalts"},{"$f":"IF('Tex-501-C'!$G$276=\"\",\"\",'Tex-501-C'!$G$276)","v":"Weight of # 20 Sieve & Pan, g:"}]
[214,{"$f":"IF('Tex-501-C'!$H$277=\"\",\"\",'Tex-501-C'!$H$277)","v":""},{"$f":"IF('Tex-501-C'!$B$220=\"\",\"\",'Tex-501-C'!$B$220)","v":"Tex-521-C : Testing Emulsified Asphalts"},{"$f":"IF('Tex-501-C'!$G$277=\"\",\"\",'Tex-501-C'!$G$277)","v":"Weight of # 20 Sieve, Pan & Residue, g:"}]
[215,{"$f":"IF('Tex-501-C'!$F$282=\"\",\"\",'Tex-501-C'!$F$282)","v":""},{"$f":"IF('Tex-501-C'!$B$280=\"\",\"\",'Tex-501-C'!$B$280)","v":"Tex 528-C : Viscosity by Vacuum Capillary Viscometer"},{"$f":"IF('Tex-501-C'!$E$282=\"\",\"\",'Tex-501-C'!$E$282)","v":"Viscosity at 140º Fahrenheit, poise:"}]
[216,{"$f":"IF('Tex-501-C'!$F$284=\"\",\"\",'Tex-501-C'!$F$284)","v":""},{"$f":"IF('Tex-501-C'!$B$280=\"\",\"\",'Tex-501-C'!$B$280)","v":"Tex 528-C : Viscosity by Vacuum Capillary Viscometer"},{"$f":"IF('Tex-501-C'!$E$284=\"\",\"\",'Tex-501-C'!$E$284)","v":"Tube Number"}]
[217,{"$f":"IF('Tex-501-C'!$F$285=\"\",\"\",'Tex-501-C'!$F$285)","v":""},{"$f":"IF('Tex-501-C'!$B$280=\"\",\"\",'Tex-501-C'!$B$280)","v":"Tex 528-C : Viscosity by Vacuum Capillary Viscometer"},{"$f":"IF('Tex-501-C'!$E$285=\"\",\"\",'Tex-501-C'!$E$285)","v":"Size"}]
[218,{"$f":"IF('Tex-501-C'!$E$289=\"\",\"\",'Tex-501-C'!$E$289)","v":""},{"$f":"IF('Tex-501-C'!$B$280=\"\",\"\",'Tex-501-C'!$B$280)","v":"Tex 528-C : Viscosity by Vacuum Capillary Viscometer"},{"$f":"IF('Tex-501-C'!$E$287=\"\",\"\",'Tex-501-C'!$E$287)","v":"Time, seconds"}]
[219,{"$f":"IF('Tex-501-C'!$F$289=\"\",\"\",'Tex-501-C'!$F$289)","v":""},{"$f":"IF('Tex-501-C'!$B$280=\"\",\"\",'Tex-501-C'!$B$280)","v":"Tex 528-C : Viscosity by Vacuum Capillary Viscometer"},{"$f":"IF('Tex-501-C'!$F$287=\"\",\"\",'Tex-501-C'!$F$287)","v":"Viscosity Constant"}]
[220,{"$f":"IF('Tex-501-C'!$G$289=\"\",\"\",'Tex-501-C'!$G$289)","v":""},{"$f":"IF('Tex-501-C'!$B$280=\"\",\"\",'Tex-501-C'!$B$280)","v":"Tex 528-C : Viscosity by Vacuum Capillary Viscometer"},{"$f":"IF('Tex-501-C'!$G$287=\"\",\"\",'Tex-501-C'!$G$287)","v":"Viscosity, poise"}]
[221,{"$f":"IF('Tex-501-C'!$E$290=\"\",\"\",'Tex-501-C'!$E$290)","v":""},{"$f":"IF('Tex-501-C'!$B$280=\"\",\"\",'Tex-501-C'!$B$280)","v":"Tex 528-C : Viscosity by Vacuum Capillary Viscometer"},{"$f":"IF('Tex-501-C'!$E$287=\"\",\"\",'Tex-501-C'!$E$287)","v":"Time, seconds"}]
[222,{"$f":"IF('Tex-501-C'!$F$290=\"\",\"\",'Tex-501-C'!$F$290)","v":""},{"$f":"IF('Tex-501-C'!$B$280=\"\",\"\",'Tex-501-C'!$B$280)","v":"Tex 528-C : Viscosity by Vacuum Capillary Viscometer"},{"$f":"IF('Tex-501-C'!$F$287=\"\",\"\",'Tex-501-C'!$F$287)","v":"Viscosity Constant"}]
[223,{"$f":"IF('Tex-501-C'!$G$290=\"\",\"\",'Tex-501-C'!$G$290)","v":""},{"$f":"IF('Tex-501-C'!$B$280=\"\",\"\",'Tex-501-C'!$B$280)","v":"Tex 528-C : Viscosity by Vacuum Capillary Viscometer"},{"$f":"IF('Tex-501-C'!$G$287=\"\",\"\",'Tex-501-C'!$G$287)","v":"Viscosity, poise"}]
[224,{"$f":"IF('Tex-501-C'!$G$292=\"\",\"\",'Tex-501-C'!$G$292)","v":""},{"$f":"IF('Tex-501-C'!$B$280=\"\",\"\",'Tex-501-C'!$B$280)","v":"Tex 528-C : Viscosity by Vacuum Capillary Viscometer"},{"$f":"IF('Tex-501-C'!$F$292=\"\",\"\",'Tex-501-C'!$F$292)","v":"Average"}]
[225,{"$f":"IF('Tex-501-C'!$F$296=\"\",\"\",'Tex-501-C'!$F$296)","v":""},{"$f":"IF('Tex-501-C'!$B$294=\"\",\"\",'Tex-501-C'!$B$294)","v":"Tex 528-C : Viscosity by Vacuum Capillary Viscometer"},{"$f":"IF('Tex-501-C'!$E$296=\"\",\"\",'Tex-501-C'!$E$296)","v":"Viscosity at 275º Fahrenheit, poise:"}]
[226,{"$f":"IF('Tex-501-C'!$F$298=\"\",\"\",'Tex-501-C'!$F$298)","v":""},{"$f":"IF('Tex-501-C'!$B$294=\"\",\"\",'Tex-501-C'!$B$294)","v":"Tex 528-C : Viscosity by Vacuum Capillary Viscometer"},{"$f":"IF('Tex-501-C'!$E$298=\"\",\"\",'Tex-501-C'!$E$298)","v":"Tube Number"}]
[227,{"$f":"IF('Tex-501-C'!$F$299=\"\",\"\",'Tex-501-C'!$F$299)","v":""},{"$f":"IF('Tex-501-C'!$B$294=\"\",\"\",'Tex-501-C'!$B$294)","v":"Tex 528-C : Viscosity by Vacuum Capillary Viscometer"},{"$f":"IF('Tex-501-C'!$E$299=\"\",\"\",'Tex-501-C'!$E$299)","v":"Size"}]
[228,{"$f":"IF('Tex-501-C'!$E$303=\"\",\"\",'Tex-501-C'!$E$303)","v":""},{"$f":"IF('Tex-501-C'!$B$294=\"\",\"\",'Tex-501-C'!$B$294)","v":"Tex 528-C : Viscosity by Vacuum Capillary Viscometer"},{"$f":"IF('Tex-501-C'!$E$301=\"\",\"\",'Tex-501-C'!$E$301)","v":"Time, seconds"}]
[229,{"$f":"IF('Tex-501-C'!$F$303=\"\",\"\",'Tex-501-C'!$F$303)","v":""},{"$f":"IF('Tex-501-C'!$B$294=\"\",\"\",'Tex-501-C'!$B$294)","v":"Tex 528-C : Viscosity by Vacuum Capillary Viscometer"},{"$f":"IF('Tex-501-C'!$F$301=\"\",\"\",'Tex-501-C'!$F$301)","v":"Viscosity Constant"}]
[230,{"$f":"IF('Tex-501-C'!$G$303=\"\",\"\",'Tex-501-C'!$G$303)","v":""},{"$f":"IF('Tex-501-C'!$B$294=\"\",\"\",'Tex-501-C'!$B$294)","v":"Tex 528-C : Viscosity by Vacuum Capillary Viscometer"},{"$f":"IF('Tex-501-C'!$G$301=\"\",\"\",'Tex-501-C'!$G$301)","v":"Viscosity, poise"}]
[231,{"$f":"IF('Tex-501-C'!$E$304=\"\",\"\",'Tex-501-C'!$E$304)","v":""},{"$f":"IF('Tex-501-C'!$B$294=\"\",\"\",'Tex-501-C'!$B$294)","v":"Tex 528-C : Viscosity by Vacuum Capillary Viscometer"},{"$f":"IF('Tex-501-C'!$E$301=\"\",\"\",'Tex-501-C'!$E$301)","v":"Time, seconds"}]
[232,{"$f":"IF('Tex-501-C'!$F$304=\"\",\"\",'Tex-501-C'!$F$304)","v":""},{"$f":"IF('Tex-501-C'!$B$294=\"\",\"\",'Tex-501-C'!$B$294)","v":"Tex 528-C : Viscosity by Vacuum Capillary Viscometer"},{"$f":"IF('Tex-501-C'!$F$301=\"\",\"\",'Tex-501-C'!$F$301)","v":"Viscosity Constant"}]
[233,{"$f":"IF('Tex-501-C'!$G$304=\"\",\"\",'Tex-501-C'!$G$304)","v":""},{"$f":"IF('Tex-501-C'!$B$294=\"\",\"\",'Tex-501-C'!$B$294)","v":"Tex 528-C : Viscosity by Vacuum Capillary Viscometer"},{"$f":"IF('Tex-501-C'!$G$301=\"\",\"\",'Tex-501-C'!$G$301)","v":"Viscosity, poise"}]
[234,{"$f":"IF('Tex-501-C'!$G$306=\"\",\"\",'Tex-501-C'!$G$306)","v":""},{"$f":"IF('Tex-501-C'!$B$294=\"\",\"\",'Tex-501-C'!$B$294)","v":"Tex 528-C : Viscosity by Vacuum Capillary Viscometer"},{"$f":"IF('Tex-501-C'!$F$306=\"\",\"\",'Tex-501-C'!$F$306)","v":"Average"}]
[235,{"$f":"IF('Tex-501-C'!$G$310=\"\",\"\",'Tex-501-C'!$G$310)","v":""},{"$f":"IF('Tex-501-C'!$B$308=\"\",\"\",'Tex-501-C'!$B$308)","v":"Tex 529-C : Kinematic Viscosity of Asphalts (Bitumens) "},{"$f":"IF('Tex-501-C'!$F$310=\"\",\"\",'Tex-501-C'!$F$310)","v":"KINEMATIC VISCOSITY AT 140°F, cSt:"}]
[236,{"$f":"IF('Tex-501-C'!$F$312=\"\",\"\",'Tex-501-C'!$F$312)","v":""},{"$f":"IF('Tex-501-C'!$B$308=\"\",\"\",'Tex-501-C'!$B$308)","v":"Tex 529-C : Kinematic Viscosity of Asphalts (Bitumens) "},{"$f":"IF('Tex-501-C'!$E$312=\"\",\"\",'Tex-501-C'!$E$312)","v":"Tube Number:"}]
[237,{"$f":"IF('Tex-501-C'!$F$314=\"\",\"\",'Tex-501-C'!$F$314)","v":""},{"$f":"IF('Tex-501-C'!$B$308=\"\",\"\",'Tex-501-C'!$B$308)","v":"Tex 529-C : Kinematic Viscosity of Asphalts (Bitumens) "},{"$f":"IF('Tex-501-C'!$E$314=\"\",\"\",'Tex-501-C'!$E$314)","v":"Tube Size:"}]
[238,{"$f":"IF('Tex-501-C'!$E$318=\"\",\"\",'Tex-501-C'!$E$318)","v":""},{"$f":"IF('Tex-501-C'!$B$308=\"\",\"\",'Tex-501-C'!$B$308)","v":"Tex 529-C : Kinematic Viscosity of Asphalts (Bitumens) "},{"$f":"IF('Tex-501-C'!$E$316=\"\",\"\",'Tex-501-C'!$E$316)","v":"Time, seconds"}]
[239,{"$f":"IF('Tex-501-C'!$F$318=\"\",\"\",'Tex-501-C'!$F$318)","v":""},{"$f":"IF('Tex-501-C'!$B$308=\"\",\"\",'Tex-501-C'!$B$308)","v":"Tex 529-C : Kinematic Viscosity of Asphalts (Bitumens) "},{"$f":"IF('Tex-501-C'!$F$316=\"\",\"\",'Tex-501-C'!$F$316)","v":"Viscosity Constant"}]
[240,{"$f":"IF('Tex-501-C'!$G$318=\"\",\"\",'Tex-501-C'!$G$318)","v":""},{"$f":"IF('Tex-501-C'!$B$308=\"\",\"\",'Tex-501-C'!$B$308)","v":"Tex 529-C : Kinematic Viscosity of Asphalts (Bitumens) "},{"$f":"IF('Tex-501-C'!$G$316=\"\",\"\",'Tex-501-C'!$G$316)","v":"Viscosity, cSt"}]
[241,{"$f":"IF('Tex-501-C'!$E$319=\"\",\"\",'Tex-501-C'!$E$319)","v":""},{"$f":"IF('Tex-501-C'!$B$308=\"\",\"\",'Tex-501-C'!$B$308)","v":"Tex 529-C : Kinematic Viscosity of Asphalts (Bitumens) "},{"$f":"IF('Tex-501-C'!$E$316=\"\",\"\",'Tex-501-C'!$E$316)","v":"Time, seconds"}]
[242,{"$f":"IF('Tex-501-C'!$F$319=\"\",\"\",'Tex-501-C'!$F$319)","v":""},{"$f":"IF('Tex-501-C'!$B$308=\"\",\"\",'Tex-501-C'!$B$308)","v":"Tex 529-C : Kinematic Viscosity of Asphalts (Bitumens) "},{"$f":"IF('Tex-501-C'!$F$316=\"\",\"\",'Tex-501-C'!$F$316)","v":"Viscosity Constant"}]
[243,{"$f":"IF('Tex-501-C'!$G$319=\"\",\"\",'Tex-501-C'!$G$319)","v":""},{"$f":"IF('Tex-501-C'!$B$308=\"\",\"\",'Tex-501-C'!$B$308)","v":"Tex 529-C : Kinematic Viscosity of Asphalts (Bitumens) "},{"$f":"IF('Tex-501-C'!$G$316=\"\",\"\",'Tex-501-C'!$G$316)","v":"Viscosity, cSt"}]
[244,{"$f":"IF('Tex-501-C'!$G$321=\"\",\"\",'Tex-501-C'!$G$321)","v":""},{"$f":"IF('Tex-501-C'!$B$308=\"\",\"\",'Tex-501-C'!$B$308)","v":"Tex 529-C : Kinematic Viscosity of Asphalts (Bitumens) "},{"$f":"IF('Tex-501-C'!$F$321=\"\",\"\",'Tex-501-C'!$F$321)","v":"Average"}]
[245,{"$f":"IF('Tex-501-C'!$F$325=\"\",\"\",'Tex-501-C'!$F$325)","v":""},{"$f":"IF('Tex-501-C'!$B$323=\"\",\"\",'Tex-501-C'!$B$323)","v":"Tex 539-C : Elastic Recovery of Bituminous Materials"},{"$f":"IF('Tex-501-C'!$D$325=\"\",\"\",'Tex-501-C'!$D$325)","v":"Recovery at ºF, %:"}]
[246,{"$f":"IF('Tex-501-C'!$F$327=\"\",\"\",'Tex-501-C'!$F$327)","v":""},{"$f":"IF('Tex-501-C'!$B$323=\"\",\"\",'Tex-501-C'!$B$323)","v":"Tex 539-C : Elastic Recovery of Bituminous Materials"},{"$f":"IF('Tex-501-C'!$E$327=\"\",\"\",'Tex-501-C'!$E$327)","v":"Length of Cut Sample After (1) Hour, cm:"}]
[247,{"$f":"IF('Tex-501-C'!$F$329=\"\",\"\",'Tex-501-C'!$F$329)","v":""},{"$f":"IF('Tex-501-C'!$B$323=\"\",\"\",'Tex-501-C'!$B$323)","v":"Tex 539-C : Elastic Recovery of Bituminous Materials"},{"$f":"IF('Tex-501-C'!$E$329=\"\",\"\",'Tex-501-C'!$E$329)","v":"Distance of Pull (Before Cut), cm:"}]
[248,{"$f":"IF('Tex-501-C'!$F$331=\"\",\"\",'Tex-501-C'!$F$331)","v":""},{"$f":"IF('Tex-501-C'!$B$323=\"\",\"\",'Tex-501-C'!$B$323)","v":"Tex 539-C : Elastic Recovery of Bituminous Materials"},{"$f":"IF('Tex-501-C'!$E$331=\"\",\"\",'Tex-501-C'!$E$331)","v":"Temperature, °F:"}]
[249,{"$f":"IF('Tex-501-C'!$F$333=\"\",\"\",'Tex-501-C'!$F$333)","v":""},{"$f":"IF('Tex-501-C'!$B$323=\"\",\"\",'Tex-501-C'!$B$323)","v":"Tex 539-C : Elastic Recovery of Bituminous Materials"},{"$f":"IF('Tex-501-C'!$D$333=\"\",\"\",'Tex-501-C'!$D$333)","v":"Travel Speed, cm/min."}]
[250,{"$f":"IF('Tex-501-C'!$G$337=\"\",\"\",'Tex-501-C'!$G$337)","v":""},{"$f":"IF('Tex-501-C'!$B$335=\"\",\"\",'Tex-501-C'!$B$335)","v":"Tex 540-C : Measurement of Polymer Separation on Heating in Modified Asphalt Systems"},{"$f":"IF('Tex-501-C'!$F$337=\"\",\"\",'Tex-501-C'!$F$337)","v":"Polymer Separation After Heating"}]
[251,{"$f":"IF('Tex-501-C'!$H$339=\"\",\"\",'Tex-501-C'!$H$339)","v":""},{"$f":"IF('Tex-501-C'!$B$335=\"\",\"\",'Tex-501-C'!$B$335)","v":"Tex 540-C : Measurement of Polymer Separation on Heating in Modified Asphalt Systems"},{"$f":"IF('Tex-501-C'!$G$339=\"\",\"\",'Tex-501-C'!$G$339)","v":"Difference in Top and Bottom Softening Points as a Percentage of the Largest Value."}]
[252,{"$f":"IF('Tex-501-C'!$F$343=\"\",\"\",'Tex-501-C'!$F$343)","v":""},{"$f":"IF('Tex-501-C'!$B$335=\"\",\"\",'Tex-501-C'!$B$335)","v":"Tex 540-C : Measurement of Polymer Separation on Heating in Modified Asphalt Systems"},{"$f":"IF('Tex-501-C'!$E$343=\"\",\"\",'Tex-501-C'!$E$343)","v":"TOP, Softening Point, °F:"}]
[253,{"$f":"IF('Tex-501-C'!$F$345=\"\",\"\",'Tex-501-C'!$F$345)","v":""},{"$f":"IF('Tex-501-C'!$B$335=\"\",\"\",'Tex-501-C'!$B$335)","v":"Tex 540-C : Measurement of Polymer Separation on Heating in Modified Asphalt Systems"},{"$f":"IF('Tex-501-C'!$E$345=\"\",\"\",'Tex-501-C'!$E$345)","v":"BOTTOM, Softening Point, °F:"}]
[254,{"$f":"IF('Tex-501-C'!$F$347=\"\",\"\",'Tex-501-C'!$F$347)","v":""},{"$f":"IF('Tex-501-C'!$B$335=\"\",\"\",'Tex-501-C'!$B$335)","v":"Tex 540-C : Measurement of Polymer Separation on Heating in Modified Asphalt Systems"},{"$f":"IF('Tex-501-C'!$E$347=\"\",\"\",'Tex-501-C'!$E$347)","v":"Bath Medium"}]
[255,{"$f":"IF('Tex-501-C'!$D$349=\"\",\"\",'Tex-501-C'!$D$349)","v":""},{"$f":"IF('Tex-501-C'!$B$335=\"\",\"\",'Tex-501-C'!$B$335)","v":"Tex 540-C : Measurement of Polymer Separation on Heating in Modified Asphalt Systems"},{"$f":"IF('Tex-501-C'!$C$349=\"\",\"\",'Tex-501-C'!$C$349)","v":"Performance Grade"}]
[256,{"$f":"IF('Tex-501-C'!$F$353=\"\",\"\",'Tex-501-C'!$F$353)","v":""},{"$f":"IF('Tex-501-C'!$B$351=\"\",\"\",'Tex-501-C'!$B$351)","v":"AASHTO TP5 : Dynamic Shear Rheometer"},{"$f":"IF('Tex-501-C'!$C$353=\"\",\"\",'Tex-501-C'!$C$353)","v":"Dynamic Shear Rheometer, G*/sin(delta) kPa:"}]
[257,{"$f":"IF('Tex-501-C'!$F$354=\"\",\"\",'Tex-501-C'!$F$354)","v":""},{"$f":"IF('Tex-501-C'!$B$351=\"\",\"\",'Tex-501-C'!$B$351)","v":"AASHTO TP5 : Dynamic Shear Rheometer"},{"$f":"IF('Tex-501-C'!$E$354=\"\",\"\",'Tex-501-C'!$E$354)","v":"Test Temperature, °C:"}]
[258,{"$f":"IF('Tex-501-C'!$F$359=\"\",\"\",'Tex-501-C'!$F$359)","v":""},{"$f":"IF('Tex-501-C'!$B$356=\"\",\"\",'Tex-501-C'!$B$356)","v":"AASHTO T240 : Rolling Thin Film Oven (Tests on Residue)"},{"$f":"IF('Tex-501-C'!$C$359=\"\",\"\",'Tex-501-C'!$C$359)","v":"Dynamic Shear Rheometer, G*/sin(delta) kPa:"}]
[259,{"$f":"IF('Tex-501-C'!$F$360=\"\",\"\",'Tex-501-C'!$F$360)","v":""},{"$f":"IF('Tex-501-C'!$B$356=\"\",\"\",'Tex-501-C'!$B$356)","v":"AASHTO T240 : Rolling Thin Film Oven (Tests on Residue)"},{"$f":"IF('Tex-501-C'!$E$360=\"\",\"\",'Tex-501-C'!$E$360)","v":" Test Temperature, °C:"}]
[260,{"$f":"IF('Tex-501-C'!$F$365=\"\",\"\",'Tex-501-C'!$F$365)","v":""},{"$f":"IF('Tex-501-C'!$B$362=\"\",\"\",'Tex-501-C'!$B$362)","v":"AASHTO PP1 : Pressure Aged Vessel Test (Tests on Residue)"},{"$f":"IF('Tex-501-C'!$C$365=\"\",\"\",'Tex-501-C'!$C$365)","v":"Dynamic Shear Rheometer, G*sin(delta) Mpa:"}]
[261,{"$f":"IF('Tex-501-C'!$F$366=\"\",\"\",'Tex-501-C'!$F$366)","v":""},{"$f":"IF('Tex-501-C'!$B$362=\"\",\"\",'Tex-501-C'!$B$362)","v":"AASHTO PP1 : Pressure Aged Vessel Test (Tests on Residue)"},{"$f":"IF('Tex-501-C'!$E$366=\"\",\"\",'Tex-501-C'!$E$366)","v":" Test Temperature, °C:"}]
[262,{"$f":"IF('Tex-501-C'!$F$369=\"\",\"\",'Tex-501-C'!$F$369)","v":""},{"$f":"IF('Tex-501-C'!$B$362=\"\",\"\",'Tex-501-C'!$B$362)","v":"AASHTO PP1 : Pressure Aged Vessel Test (Tests on Residue)"},{"$f":"IF('Tex-501-C'!$E$369=\"\",\"\",'Tex-501-C'!$E$369)","v":"Creep Stiffness, Mpa:"}]
[263,{"$f":"IF('Tex-501-C'!$F$370=\"\",\"\",'Tex-501-C'!$F$370)","v":""},{"$f":"IF('Tex-501-C'!$B$362=\"\",\"\",'Tex-501-C'!$B$362)","v":"AASHTO PP1 : Pressure Aged Vessel Test (Tests on Residue)"},{"$f":"IF('Tex-501-C'!$E$370=\"\",\"\",'Tex-501-C'!$E$370)","v":"M - Value"}]
[264,{"$f":"IF('Tex-501-C'!$F$371=\"\",\"\",'Tex-501-C'!$F$371)","v":""},{"$f":"IF('Tex-501-C'!$B$362=\"\",\"\",'Tex-501-C'!$B$362)","v":"AASHTO PP1 : Pressure Aged Vessel Test (Tests on Residue)"},{"$f":"IF('Tex-501-C'!$E$371=\"\",\"\",'Tex-501-C'!$E$371)","v":"Test Temperature, °C:"}]
[265,{"$f":"IF('Tex-501-C'!$F$374=\"\",\"\",'Tex-501-C'!$F$374)","v":""},{"$f":"IF('Tex-501-C'!$B$362=\"\",\"\",'Tex-501-C'!$B$362)","v":"AASHTO PP1 : Pressure Aged Vessel Test (Tests on Residue)"},{"$f":"IF('Tex-501-C'!$E$374=\"\",\"\",'Tex-501-C'!$E$374)","v":"Direst Tension"}]
[266,{"$f":"IF('Tex-501-C'!$F$375=\"\",\"\",'Tex-501-C'!$F$375)","v":""},{"$f":"IF('Tex-501-C'!$B$362=\"\",\"\",'Tex-501-C'!$B$362)","v":"AASHTO PP1 : Pressure Aged Vessel Test (Tests on Residue)"},{"$f":"IF('Tex-501-C'!$E$375=\"\",\"\",'Tex-501-C'!$E$375)","v":"Test Temperature, °C:"}]
[267,{"$f":"IF('Tex-501-C'!$G$378=\"\",\"\",'Tex-501-C'!$G$378)","v":""},{"$f":"IF('Tex-501-C'!$B$377=\"\",\"\",'Tex-501-C'!$B$377)","v":"AASHTO TP48 : Rotational Viscosity (Brookfield)(275ºF/135ºC)"},{"$f":"IF('Tex-501-C'!$F$378=\"\",\"\",'Tex-501-C'!$F$378)","v":"Rotational Viscosity at  °C, Mpa:"}]
[268,{"$f":"IF('Tex-501-C'!$E$381=\"\",\"\",'Tex-501-C'!$E$381)","v":""},{"$f":"IF('Tex-501-C'!$B$377=\"\",\"\",'Tex-501-C'!$B$377)","v":"AASHTO TP48 : Rotational Viscosity (Brookfield)(275ºF/135ºC)"},{"$f":"IF('Tex-501-C'!$D$381=\"\",\"\",'Tex-501-C'!$D$381)","v":"Viscosity, Mpa:"},{"$f":"IF('Tex-501-C'!$E$380=\"\",\"\",'Tex-501-C'!$E$380)","v":"1, minute"}]
[269,{"$f":"IF('Tex-501-C'!$F$381=\"\",\"\",'Tex-501-C'!$F$381)","v":""},{"$f":"IF('Tex-501-C'!$B$377=\"\",\"\",'Tex-501-C'!$B$377)","v":"AASHTO TP48 : Rotational Viscosity (Brookfield)(275ºF/135ºC)"},{"$f":"IF('Tex-501-C'!$D$381=\"\",\"\",'Tex-501-C'!$D$381)","v":"Viscosity, Mpa:"},{"$f":"IF('Tex-501-C'!$F$380=\"\",\"\",'Tex-501-C'!$F$380)","v":"2, minutes"}]
[270,{"$f":"IF('Tex-501-C'!$G$381=\"\",\"\",'Tex-501-C'!$G$381)","v":""},{"$f":"IF('Tex-501-C'!$B$377=\"\",\"\",'Tex-501-C'!$B$377)","v":"AASHTO TP48 : Rotational Viscosity (Brookfield)(275ºF/135ºC)"},{"$f":"IF('Tex-501-C'!$D$381=\"\",\"\",'Tex-501-C'!$D$381)","v":"Viscosity, Mpa:"},{"$f":"IF('Tex-501-C'!$G$380=\"\",\"\",'Tex-501-C'!$G$380)","v":"3, minutes"}]
[271,{"$f":"IF('Tex-501-C'!$G$382=\"\",\"\",'Tex-501-C'!$G$382)","v":""},{"$f":"IF('Tex-501-C'!$B$377=\"\",\"\",'Tex-501-C'!$B$377)","v":"AASHTO TP48 : Rotational Viscosity (Brookfield)(275ºF/135ºC)"},{"$f":"IF('Tex-501-C'!$F$382=\"\",\"\",'Tex-501-C'!$F$382)","v":"Test Temperature, °C:"}]
[272,{"$f":"IF('Tex-501-C'!$G$383=\"\",\"\",'Tex-501-C'!$G$383)","v":""},{"$f":"IF('Tex-501-C'!$B$377=\"\",\"\",'Tex-501-C'!$B$377)","v":"AASHTO TP48 : Rotational Viscosity (Brookfield)(275ºF/135ºC)"},{"$f":"IF('Tex-501-C'!$F$383=\"\",\"\",'Tex-501-C'!$F$383)","v":"Speed"}]
[273,{"$f":"IF('Tex-501-C'!$G$384=\"\",\"\",'Tex-501-C'!$G$384)","v":""},{"$f":"IF('Tex-501-C'!$B$377=\"\",\"\",'Tex-501-C'!$B$377)","v":"AASHTO TP48 : Rotational Viscosity (Brookfield)(275ºF/135ºC)"},{"$f":"IF('Tex-501-C'!$F$384=\"\",\"\",'Tex-501-C'!$F$384)","v":"Spindel Number"}]
[274,{"$f":"IF('Tex-501-C'!$G$387=\"\",\"\",'Tex-501-C'!$G$387)","v":""},{"$f":"IF('Tex-501-C'!$B$386=\"\",\"\",'Tex-501-C'!$B$386)","v":"AASHTO TP48 : Rotational Viscosity (Brookfield)(325ºF/163ºC)"},{"$f":"IF('Tex-501-C'!$F$387=\"\",\"\",'Tex-501-C'!$F$387)","v":"Rotational Viscosity at °C, Mpa:"}]
[275,{"$f":"IF('Tex-501-C'!$E$390=\"\",\"\",'Tex-501-C'!$E$390)","v":""},{"$f":"IF('Tex-501-C'!$B$386=\"\",\"\",'Tex-501-C'!$B$386)","v":"AASHTO TP48 : Rotational Viscosity (Brookfield)(325ºF/163ºC)"},{"$f":"IF('Tex-501-C'!$D$390=\"\",\"\",'Tex-501-C'!$D$390)","v":"Viscosity, Mpa:"},{"$f":"IF('Tex-501-C'!$E$389=\"\",\"\",'Tex-501-C'!$E$389)","v":"1, minute"}]
[276,{"$f":"IF('Tex-501-C'!$F$390=\"\",\"\",'Tex-501-C'!$F$390)","v":""},{"$f":"IF('Tex-501-C'!$B$386=\"\",\"\",'Tex-501-C'!$B$386)","v":"AASHTO TP48 : Rotational Viscosity (Brookfield)(325ºF/163ºC)"},{"$f":"IF('Tex-501-C'!$D$390=\"\",\"\",'Tex-501-C'!$D$390)","v":"Viscosity, Mpa:"},{"$f":"IF('Tex-501-C'!$F$389=\"\",\"\",'Tex-501-C'!$F$389)","v":"2, minutes"}]
[277,{"$f":"IF('Tex-501-C'!$G$390=\"\",\"\",'Tex-501-C'!$G$390)","v":""},{"$f":"IF('Tex-501-C'!$B$386=\"\",\"\",'Tex-501-C'!$B$386)","v":"AASHTO TP48 : Rotational Viscosity (Brookfield)(325ºF/163ºC)"},{"$f":"IF('Tex-501-C'!$D$390=\"\",\"\",'Tex-501-C'!$D$390)","v":"Viscosity, Mpa:"},{"$f":"IF('Tex-501-C'!$G$389=\"\",\"\",'Tex-501-C'!$G$389)","v":"3, minutes"}]
[278,{"$f":"IF('Tex-501-C'!$G$391=\"\",\"\",'Tex-501-C'!$G$391)","v":""},{"$f":"IF('Tex-501-C'!$B$386=\"\",\"\",'Tex-501-C'!$B$386)","v":"AASHTO TP48 : Rotational Viscosity (Brookfield)(325ºF/163ºC)"},{"$f":"IF('Tex-501-C'!$F$391=\"\",\"\",'Tex-501-C'!$F$391)","v":"Test Temperature, °C:"}]
[279,{"$f":"IF('Tex-501-C'!$G$392=\"\",\"\",'Tex-501-C'!$G$392)","v":""},{"$f":"IF('Tex-501-C'!$B$386=\"\",\"\",'Tex-501-C'!$B$386)","v":"AASHTO TP48 : Rotational Viscosity (Brookfield)(325ºF/163ºC)"},{"$f":"IF('Tex-501-C'!$F$392=\"\",\"\",'Tex-501-C'!$F$392)","v":"Speed"}]
[280,{"$f":"IF('Tex-501-C'!$G$393=\"\",\"\",'Tex-501-C'!$G$393)","v":""},{"$f":"IF('Tex-501-C'!$B$386=\"\",\"\",'Tex-501-C'!$B$386)","v":"AASHTO TP48 : Rotational Viscosity (Brookfield)(325ºF/163ºC)"},{"$f":"IF('Tex-501-C'!$F$393=\"\",\"\",'Tex-501-C'!$F$393)","v":"Spindel Number"}]
[281,{"$f":"IF('Tex-501-C'!$C$403=\"\",\"\",'Tex-501-C'!$C$403)","v":""},"Sampled By ",{"$f":"IF('Tex-501-C'!$B$403=\"\",\"\",'Tex-501-C'!$B$403)","v":"TX500PI"}]
[282,{"$f":"IF('Tex-501-C'!$F$403=\"\",\"\",'Tex-501-C'!$F$403)","v":""},"Sampled Date ",{"$f":"IF('Tex-501-C'!$B$403=\"\",\"\",'Tex-501-C'!$B$403)","v":"TX500PI"}]
[283,{"$f":"IF('Tex-501-C'!$C$404=\"\",\"\",'Tex-501-C'!$C$404)","v":""},"Sampled By ",{"$f":"IF('Tex-501-C'!$B$404=\"\",\"\",'Tex-501-C'!$B$404)","v":"TX500PII"}]
[284,{"$f":"IF('Tex-501-C'!$F$404=\"\",\"\",'Tex-501-C'!$F$404)","v":""},"Sampled Date ",{"$f":"IF('Tex-501-C'!$B$404=\"\",\"\",'Tex-501-C'!$B$404)","v":"TX500PII"}]
[285,{"$f":"IF('Tex-501-C'!$C$405=\"\",\"\",'Tex-501-C'!$C$405)","v":""},"Sampled By ",{"$f":"IF('Tex-501-C'!$B$405=\"\",\"\",'Tex-501-C'!$B$405)","v":"TX500PIII"}]
[286,{"$f":"IF('Tex-501-C'!$F$405=\"\",\"\",'Tex-501-C'!$F$405)","v":""},"Sampled Date ",{"$f":"IF('Tex-501-C'!$B$405=\"\",\"\",'Tex-501-C'!$B$405)","v":"TX500PIII"}]
[287,{"$f":"IF('Tex-501-C'!$C$406=\"\",\"\",'Tex-501-C'!$C$406)","v":""},"Sampled By ",{"$f":"IF('Tex-501-C'!$B$406=\"\",\"\",'Tex-501-C'!$B$406)","v":"TX500PIX"}]
[288,{"$f":"IF('Tex-501-C'!$F$406=\"\",\"\",'Tex-501-C'!$F$406)","v":""},"Sampled Date ",{"$f":"IF('Tex-501-C'!$B$406=\"\",\"\",'Tex-501-C'!$B$406)","v":"TX500PIX"}]

{"sheet":"Revisions","index":3,"n_rows":2,"n_cols":9,"rows_kept":2,"cut":false,"hidden":true,"merged":[[42,1,42,7],[43,1,43,7],[44,1,44,7],[36,1,36,7],[37,1,37,7],[38,1,38,7],[39,1,39,7],[40,1,40,7],[41,1,41,7],[35,1,35,7],[24,1,24,7],[25,1,25,7],[26,1,26,7],[27,1,27,7],[28,1,28,7],[29,1,29,7],[30,1,30,7],[31,1,31,7],[32,1,32,7],[33,1,33,7],[34,1,34,7],[23,1,23,7],[12,1,12,7],[13,1,13,7],[14,1,14,7],[15,1,15,7],[16,1,16,7],[17,1,17,7],[18,1,18,7],[19,1,19,7],[20,1,20,7],[21,1,21,7],[22,1,22,7],[11,1,11,7],[0,1,0,7],[1,1,1,7],[2,1,2,7],[3,1,3,7],[4,1,4,7],[5,1,5,7],[6,1,6,7],[7,1,7,7],[8,1,8,7],[9,1,9,7],[10,1,10,7]]}
["Date","Description",null,null,null,null,null,null,"By"]
["2016-10-06","Remove SDEWITT from workbook",null,null,null,null,null,null,"CPFEIFF"]