{"text_format":"1","workbook":"xlsx","n_sheets":8,"sheets":["Pg1","Pg2","Pg3","Budget1","BudgetSummary","SignaturePage","dropdowns","Extract_Fields"],"not_rendered":{"charts":0,"images":4,"macros":1,"external_links":1,"defined_names":5,"comments":0,"pivot_tables":0},"unopened":[],"bounds":{"document_bytes":16777216,"sheet_cells":100000,"rows_first":2000,"rows_last":500,"rows_between":2000,"halvings":0,"cell_chars":16384,"cell_head_chars":4096},"cells_cut":0,"cells_raw":0,"read":"whole","date_system":"1900"}

{"sheet":"Pg1","index":0,"n_rows":59,"n_cols":17,"rows_kept":59,"cut":false,"hidden":false,"merged":[[58,3,59,20],[61,3,62,20],[17,8,17,12],[21,16,21,20],[25,16,25,20],[19,16,19,20],[23,16,23,20],[23,8,23,11],[17,16,17,20],[52,3,54,20],[48,3,48,18],[2,9,2,20],[2,2,4,8],[36,3,41,20],[25,8,25,11],[33,8,33,20],[9,3,9,13],[9,16,9,18],[21,8,21,11],[27,16,27,20],[19,8,19,11],[27,8,27,12],[29,13,29,20]]}
[]
[]
[null,null,"NON-INFRASTRUCTURE\nDetailed Application",null,null,null,null,null,null,"Find more program information in TxDOT's 2025 TA Call for Projects Program Guide"]
[]
[]
[]
[null,null,"APPLICANT INFORMATION"]
[]
[null,null,"1. Project Sponsor Name (Only one entity can act as project sponsor)",null,null,null,null,null,null,null,null,null,null,null,null,"2.","Jurisdiction Population"]
[]
[]
[null,null,"3. Type of Organization/Agency/Authority (Select from dropdown below)"]
[]
[]
[]
[null,null,"4. Project Sponsor Contact Information (Authorized representative)"]
[]
[null,null,null,"Contact Person:",null,null,null,null,null,null,null,null,null,null,null,"Title:"]
[]
[null,null,null,"Mailing Address:",null,null,null,null,null,null,null,null,null,null,null,"Physical Address:"]
{"$rows_left_out":40}
{"sheet":"Pg2","index":1,"n_rows":53,"n_cols":13,"rows_kept":53,"cut":false,"hidden":false,"merged":[[52,4,54,15],[26,4,29,16],[5,4,5,16],[7,4,10,16],[33,4,36,17],[39,4,40,16],[48,4,50,16],[44,4,45,16],[42,4,43,15]]}
[]
[]
[null,null,"PROJECT DETAILS"]
[null,null,"10. Detailed Project Location"]
[null,null,null,null,"Provide a Google map link: see Detailed Application Instructions for guidance."]
[]
[]
[null,null,null,null,"Most detailed applications for the non-infrastructure project category will be proposing city-wide planning documents. For these projects, the project limits will coincide with city boundaries. If the project limits do not coincide with city boundaries, please provide a shared google map link representing the project limits."]
[]
[]
[]
[]
[]
[null,null,"11. Active Transportation Plan Type:"]
[]
[null,null,"12. What area does the proposed plan cover?"]
[]
[null,null,"13. Existing Active Transportation Plans"]
[]
[null,null,null,null,"a. Does your community have any existing Active Transportation Plans?"]
{"$rows_left_out":34}
{"sheet":"Pg3","index":2,"n_rows":54,"n_cols":20,"rows_kept":54,"cut":false,"hidden":false,"merged":[[19,4,22,20],[11,4,14,21],[15,4,15,5],[17,8,17,16],[17,6,17,7],[17,4,17,5],[3,4,7,21],[27,4,30,21],[47,4,47,6],[47,7,47,18],[52,4,52,6],[44,7,45,12],[48,7,49,20],[44,13,45,20],[40,4,40,6],[40,7,40,19],[44,4,44,6],[41,7,42,20],[32,4,32,18],[35,4,35,6],[35,7,35,18],[36,7,38,20]]}
[]
[]
[null,null,"SAFETY"]
[null,null,null,null,"TxDOT is most interested in funding non-infrastructure projects where non-motorized crashes occur. Therefore, TxDOT staff will analyze the total non-motorized crashes and the non-motorized crash rates within the proposed planning area. Additionally, TxDOT will review each Project Sponsor's Proposed Scope of Work for the Planning Document project and provide a professional judgement score on the proposed safety elements therein."]
[]
[]
[]
[]
[null,null,"CONNECTIVITY AND ACCESSIBILITY"]
[]
[null,null,"16. Barrier Elimination"]
[null,null,null,null,"Will the proposed planning document consider eliminating travel barriers for individuals with disabilities, pedestrians, bicyclists, and other non-drivers? For ADA barriers, only count each type of ADA barrier that is being eliminated. For example, if your proposed planning document will be looking at city-wide gaps in ADA access, that would count as one barrier, and accessible pedestrian signals would count as another."]
[]
[]
[]
[null,null,null,null,null,null,"ADA barriers",null,null,null,"Four lane or larger roadways",null,null,null,null,"Waterbody(ies)",null,null,null,"Railroad"]
[]
[null,null,null,null,null,null,"Other"]
[]
[null,null,null,null,"TxDOT is interested in funding non-infrastructure projects that contribute to increased connectivity and accessibility. Therefore, TxDOT will review Project Sponsor's Proposed Scope of Work for the Planning Document project and provide a professional judgement score on the proposed connectivity and accessibility elements therein."]
{"$rows_left_out":35}
{"sheet":"Budget1","index":3,"n_rows":59,"n_cols":27,"rows_kept":59,"cut":false,"hidden":false,"merged":[[53,14,53,15],[53,16,53,18],[48,14,48,15],[47,3,47,11],[44,3,44,11],[45,3,45,11],[46,3,46,11],[43,3,43,11],[43,14,43,15],[53,3,53,11],[50,3,50,11],[50,14,50,15],[47,16,47,18],[48,16,48,18],[50,16,50,18],[51,3,51,11],[51,14,51,15],[51,16,51,18],[52,3,52,11],[52,14,52,15],[52,16,52,18],[49,3,49,11],[49,14,49,15],[49,16,49,18],[58,16,58,18],[27,3,27,11],[28,3,28,11],[29,3,29,11],[30,3,30,11],[31,3,31,11],[32,3,32,11],[33,3,33,11],[34,3,34,11],[35,3,35,11],[36,3,36,11],[37,3,37,11],[38,3,38,11],[39,3,39,11],[38,16,38,18],[40,16,40,18],[33,14,33,15],[40,3,40,11],[41,3,41,11],[42,3,42,11],[41,14,41,15],[42,14,42,15],[44,14,44,15],[45,14,45,15],[40,14,40,15],[27,16,27,18],[28,16,28,18],[48,3,48,11],[47,14,47,15],[42,16,42,18],[43,16,43,18],[44,16,44,18],[45,16,45,18],[46,16,46,18],[46,14,46,15],[41,16,41,18],[37,14,37,15],[57,3,57,11],[57,14,57,15],[57,16,57,18],[56,3,56,11],[56,14,56,15],[54,3,54,11],[54,14,54,15],[54,16,54,18],[56,16,56,18],[55,3,55,11],[55,14,55,15],[55,16,55,18],[25,16,25,18],[26,3,26,11],[32,16,32,18],[33,16,33,18],[34,16,34,18],[35,16,35,18],[36,16,36,18],[37,16,37,18],[29,16,29,18],[30,16,30,18],[31,16,31,18],[35,14,35,15],[34,14,34,15],[27,14,27,15],[28,14,28,15],[5,3,5,17],[21,3,21,17],[17,7,17,12],[38,14,38,15],[39,14,39,15],[26,14,26,15],[26,16,26,18],[22,16,22,18],[22,14,22,15],[22,3,22,11],[23,3,23,11],[23,14,23,15],[29,14,29,15],[30,14,30,15],[31,14,31,15],[32,14,32,15],[24,14,24,15],[24,16,24,18],[25,3,25,11],[25,14,25,15],[39,16,39,18],[23,16,23,18],[24,3,24,11],[36,14,36,15]]}
[]
[]
[]
[{"$f":"Budget1!Q59","v":0},null,"ITEMIZED BUDGET"]
[null,null,"18. Plan Elements"]
[null,null,null,"With as much detail as necessary, provide a plan development cost estimate."]
[]
[null,null,null,null,null,"exisiting plan/policy review",null,null,null,null,null,null,null,"needs assessment"]
[]
[null,null,null,null,null,"existing conditions assessment",null,null,null,null,null,null,null,"data collection"]
[]
[null,null,null,null,null,"infrastructure recommendations and user typologies",null,null,null,null,null,null,null,"project prioritization and/or recommendations"]
[]
[null,null,null,null,null,"visioning and goal/objective/priority setting",null,null,null,null,null,null,null,"policy recommendations"]
[]
[null,null,null,null,null,"public and stakeholder involvement",null,null,null,null,null,null,null,"implementation strategy"]
[]
[null,null,null,null,null,"other:"]
[]
[]
{"$rows_left_out":40}
{"sheet":"BudgetSummary","index":4,"n_rows":116,"n_cols":33,"rows_kept":116,"cut":false,"hidden":false,"merged":[[5,2,5,18],[7,4,7,15],[7,17,7,18],[13,17,13,18],[39,5,39,12],[39,14,39,15],[35,5,37,14],[15,17,15,18],[22,4,25,17],[18,4,19,17],[9,4,9,15],[9,17,9,18],[11,4,11,15],[11,17,11,18],[28,4,30,17],[43,8,43,18],[45,12,45,14],[46,12,46,14],[45,15,45,18],[46,15,46,18],[47,15,47,18],[48,15,48,18],[44,12,44,14],[44,15,44,18],[47,4,47,7],[48,4,48,7],[47,9,47,11],[48,9,48,11],[47,12,47,14],[48,12,48,14],[44,9,44,11],[45,9,45,11],[46,9,46,11],[45,4,45,7],[46,4,46,7]]}
[]
[]
[]
[null,null,null,"BUDGET SUMMARY",null,null,null,null,null,null,null,null,null,null,null,null,null,null,null,null,null,null,null,"Formulas"]
[]
[null,null,"20. Project Budget Summary (many lines automatically populate, numbers are rounded up to the nearest $1,000)"]
[]
[null,null,null,null,"Total Plan Development Cost Estimate",null,null,null,null,null,null,null,null,null,null,null,"1.",{"$f":"ROUNDUP(Budget1!Q59,-3)","v":0},null,null,null,null,null,"='Pg8'!Q56"]
[]
[null,null,null,null,"TxDOT Direct State Costs for project oversight (15% of line 1)",null,null,null,null,null,null,null,null,null,null,null,"2.",{"$f":"ROUNDUP(BudgetSummary!R8*0.15,-3)","v":0},null,null,null,null,null,"=$R$12*0.15"]
[]
[null,null,null,null,"Total Project Cost Estimate [line 1 + line 2]",null,null,null,null,null,null,null,null,null,null,null,"3.",{"$f":"ROUNDUP(R8+R10,-3)","v":0},null,null,null,null,null,"=R12+R14+R16"]
[]
[null,null,null,null,"Optional Local Match Increase*",null,null,null,null,null,null,null,0.2,"of line 3",null,null,null,{"$f":"IF(dropdowns!T1=TRUE,\"(see table below)\",BudgetSummary!LocalMatch*BudgetSummary!R12)","v":0},null,null,null,null,null,"=IF(OR(dropdowns!W2=TRUE,dropdowns!W3=TRUE),\"(see line 11)\",$M$20*$R$18)"]
[]
[null,null,null,null,"TxDOT Optional Discretionary Funds**",null,null,null,null,null,null,null,null,null,null,null,null,{"$f":"IF(dropdowns!T1=TRUE,\"(see table below)\",M16*BudgetSummary!R12)","v":0}]
[]
[]
[null,null,null,null,"TDCs: If a project sponsor is eligible to use TDCs, these credits will be applied to the project in lieu of the local match. See Cost Participation Summary below. "]
[]
{"$rows_left_out":97}
{"sheet":"SignaturePage","index":5,"n_rows":41,"n_cols":28,"rows_kept":41,"cut":false,"hidden":false,"merged":[[13,3,13,17],[21,3,21,17],[40,2,40,17],[17,3,17,17],[15,3,15,17],[23,3,23,17],[24,3,25,17],[26,3,26,16],[27,3,27,16],[29,3,29,17],[19,3,19,17],[6,15,6,16],[4,13,4,14],[6,13,6,14],[8,13,8,14],[4,15,4,16],[8,15,8,16]]}
[]
[]
[null,null,"COST PARTICIPATION SUMMARY"]
[]
[null,null,null,"Total Federal Participation ",null,null,null,null,null,null,null,null,null,{"$f":"IF(dropdowns!T1=TRUE,1,1-(BudgetSummary!M14+BudgetSummary!M16))","v":0.8},null,{"$f":"$N$5*BudgetSummary!$R$12","v":0},null,null,null,null,null,"=IF(dropdowns!$W$3=TRUE,$R$18,if(dropdowns!$W$2=TRUE,$R$18*0.8,$R$18*M20))",null,null,null,null,null,"=IF(OR(dropdowns!$W$2=TRUE,$O$47>0),0.8,1-$M$20)"]
[]
[null,null,null,"Total State Participation",null,null,null,null,null,null,null,null,null,{"$f":"IF(dropdowns!T1=TRUE,0,BudgetSummary!$M$16)","v":0},null,{"$f":"$N$7*BudgetSummary!$R$12","v":0},null,null,null,null,null,"=IF(dropdowns!W2=TRUE,'Pg10'!O49,\"--\")"]
[]
[null,null,null,"Total Local Participation",null,null,null,null,null,null,null,null,null,{"$f":"IF(dropdowns!T1=TRUE,0,BudgetSummary!$M$14)","v":0.2},null,{"$f":"$N$9*BudgetSummary!$R$12","v":0},null,null,null,null,null,"=IF(dropdowns!W3=TRUE,0,IF(dropdowns!W2=TRUE,(1-$P$53-$P$55)*$R$18,$R$22))"]
[6]
[null,null,"PROJECT COMMITMENT"]
[]
[null,null,"The applicant confirms understanding of the following requirements by checking boxes and signing below."]
[null,null,null,"This is a reimbursement program. If the project sponsor implements any stage of the project, then they must finance that phase until reimbursement funds are available. Invoices must be submitted with proper documentation on a regular basis (typically monthly, but no less than quarterly). "]
[]
[null,null,null,"If TxDOT implements any phase of the project on behalf of the project sponsor, then any local match would be due in full to TxDOT prior to commencement of each phase (i.e. plan development). Project selection does not guarantee that TxDOT will implement a project on behalf of any recipient."]
[]
[null,null,null,"Until authorized by TxDOT with a notice to proceed, the project sponsor should not enter into a contract or incur costs for any aspect of the project for which the project sponsor is seeking federal participation. Otherwise, the project sponsor risks incurring costs that will not be reimbursed."]
[]
[null,null,null,"Project sponsors may manage elements of the project development process with written TxDOT approval. To receive approval, the project sponsor acknowledges that they must complete a Special Project Approval form in accordance with 43 TAC §15.52 and undergo a Risk Assessment."]
{"$rows_left_out":22}
{"sheet":"dropdowns","index":6,"n_rows":260,"n_cols":26,"rows_kept":260,"cut":false,"hidden":true,"merged":[[9,23,9,25],[32,1,32,2],[72,1,72,2],[16,1,16,2],[151,1,151,2],[159,1,159,2],[143,1,143,2],[133,1,133,2],[3,19,3,20],[14,19,14,20],[25,19,25,20],[24,1,24,2],[1,11,1,12],[115,1,115,2],[81,1,81,2],[64,1,64,2],[54,1,54,2],[1,1,1,2],[1,5,1,6],[1,8,1,9],[106,1,106,2],[221,1,221,2],[229,1,229,2],[167,1,167,2],[175,1,175,2],[213,1,213,2],[184,1,184,2],[195,1,195,2],[204,1,204,2]]}
["Question",null,null,null,"Question",null,null,"Question",null,null,"Question",null,null,null,null,"Budget Summary",null,null,"TDC",{"$f":"IF(Q117=1,FALSE,TRUE)","v":false},{"$f":"IF(T1=TRUE,\"TDCs are eligible for local match\",\"INELIGIBLE for TDCs\")","v":"INELIGIBLE for TDCs"}]
["#3","PROJECT SPONSOR OPTIONS",null,null,"#7b","COUNTIES",null,"#7a","TxDOT DISTRICTS",null,"#8b","MPOs",null,null,null,"PSs determined eligible for TDCs"]
[null,null,"Categories",null,null,null,"County Name",null,null,"District Name",null,null,"MPO Name",null,null,null,"Options"]
[null,1,"(select)",null,null,1,"(select)",null,1,"(select)",null,1,"(select)",null,null,1,"(select)",null,null,"Project Budget Contingency estimate"]
[null,2,"Local Government",null,null,2,"Anderson",null,2,"Abilene",null,2,"Abilene MPO",null,null,2,"Brewster County",null,null,null,"Options"]
[null,3,"Regional Transportation Authority",null,null,3,"Andrews",null,3,"Amarillo",null,3,"Alama Area MPO",null,null,3,"Cameron County DOT",null,null,1,"(select)"]
[null,4,"Transit Agency",null,null,4,"Angelina",null,4,"Atlanta",null,4,"Amarillo MPO",null,null,4,"City of Alamo",null,null,2,0]
[null,5,"Natural Resource or Public Land Agency",null,null,5,"Aransas",null,5,"Austin",null,5,"Bryan-College Station MPO",null,null,5,"City of Alice",null,null,3,0.05]
[null,6,"School District, Local Education Agency, or School",null,null,6,"Archer",null,6,"Beaumont",null,6,"Capital Area MPO",null,null,6,"City of Aransas Pass",null,null,4,0.1]
[null,7,"Tribal Government",null,null,7,"Armstrong",null,7,"Brownwood",null,7,"Corpus Christi MPO",null,null,7,"City of Atlanta",null,null,5,0.15,null,null,"Color Palette"]
[null,8,"Any other governmental entity with responsibility for transportation",null,null,8,"Atascosa",null,8,"Bryan",null,8,"El Paso MPO",null,null,8,"City of Balch Springs",null,null,null,3,null,null,"Header","R",0]
[null,9,"Non-profit organization",null,null,9,"Austin",null,9,"Childress",null,9,"Grayson County MPO",null,null,9,"City of Bay CIty",null,null,null,{"$f":"LOOKUP(U11,T6:T10,U6:U10)","v":0.05},null,null,"Blue","G",86]
[null,10,"Metropolitan Planning Organization (MPO)",null,null,10,"Bailey",null,10,"Corpus Christi",null,10,"Houston-Galveston Area Council MPO",null,null,10,"City of Beaumont",null,null,null,null,null,null,null,"B",169]
[null,null,1,null,null,11,"Bandera",null,11,"Dallas",null,11,"Killeen-Temple MPO",null,null,11,"City of Beeville ",null,null,null,null,null,null,"Blanks","R",197]
[null,null,{"$f":"LOOKUP(C14,B4:B13,C4:C13)","v":"(select)"},null,null,12,"Bastrop",null,12,"El Paso",null,12,"Laredo Webb County Area MPO",null,null,12,"City of Borger",null,null,"Project assumed construction year",null,null,null,"Light brown","G",187]
[null,null,null,null,null,13,"Baylor",null,13,"Fort Worth",null,13,"Longview MPO",null,null,13,"City of Brady",null,null,null,"Options",null,null,null,"B",170]
["#8a","MPO - YES or Nos",null,null,null,14,"Bee",null,14,"Houston",null,14,"Lubbock MPO",null,null,14,"City of Breckenridge",null,null,1,"(select)",null,null,"Border #1","R",128]
[null,null,"Option",null,null,15,"Bell",null,15,"Laredo",null,15,"North Central Texas Council of Governments (NCTCOG)",null,null,15,"City of Bremond",null,null,2,"FY 2026",2026,null,"Gray","G",128]
[null,1,"(select)",null,null,16,"Bexar",null,16,"Lubbock",null,16,"Permian Basin MPO",null,null,16,"City of Bridge City",null,null,3,"FY 2027",2027,null,null,"B",128]
[null,2,"Yes",null,null,17,"Blanco",null,17,"Lufkin",null,17,"Rio Grande Valley MPO",null,null,17,"City of Brownsville",null,null,4,"FY 2028",2028,null,"Border #2 & Gen Header","R",187]
{"$rows_left_out":241}
{"sheet":"Extract_Fields","index":7,"n_rows":5,"n_cols":76,"rows_kept":5,"cut":false,"hidden":true,"merged":[]}
[]
[null,"Long Description","0. Filelocation","1. Project Sponsor Name","2. Jurisdiction population","3. Project Sponsor Type","4. Project Sponsor Contact Info - Contact Person","4. Project Sponsor Contact Info - Title","4. Project Sponsor Contact Info - Mailing Address","4. Project Sponsor Contact Info - City","4. Project Sponsor Contact Info - Zip Code","4. Project Sponsor Contact Info - Contact Phone","4. Project Sponsor Contact Info - Email","4. Project Sponsor - Physical Address","4. Project Sponsor Physical City","4. Project Sponsor Physical Zip Code","4. Project Sponsor Entity's Main Phone","4. Project Sponsor Website","4. Project Sponsor Partners","5. Project Name","6. Project Description","7. Project Location Info - County","7. Project Location Info - TX DOT District","8. Project Location Info - MPO","8. Project Location Info - Which MPO","9. SRTS related","9. Prev applied","10. Project Location Info - Google Map Link","11. ATP Type","12. Area coverage type","13a. Existing ATP?","13b. Existing ATP modes- micromobility","13b. Existing ATP modes_ped","13b. Existing ATP modes_bike","13b. Existing ATP modes_transit","13b. Existing ATP modes_ada","13. B/P Safety- Infrastructure Total","15. Public Involvement","16. Barrier Elimination- ADA","16. Barrier Elimination -wide ROW","16. Barrier Elimination- Waterbody","16. Barrier Elimination-rail","16. Barrier Elimination-other","16. Barrier Elimination-other2","17. Projected Time Estimate - TIP/AFA","17. Projected Time Estimate - Procurement","17. Projected Time Estimate - Other (months)","17. Projected Time Estimate - Other Text","17. Projected Time Estimate - Plan Dev","17. Total Projected Time Estimate","18. PlanActivities - PlanReview","18. PlanActivities - ExistCon","18. PlanActivities - InfraRecc","18. PlanActivities - VisioningGoalset","18. PlanActivities - PubInvolve","18. PlanActivities - NeedsAsses","18. PlanActivities - DataColl","18. PlanActivities -ProjPrioritization","18. PlanActivities - PolicyRec","18. PlanActivities - ImplementationStr","18. PlanActivities - Other","18. PlanActivities - OtherText","18. PlanActivities - TotalChecked","19. Itemized Plan Cost","TxDOT Direct State Costs for project oversight (Line 4)","Local Match Percentage","Optional TxDOT Match Percentage","Total Project Estimate (Line 5)","TDCs Used","TDC eligible sponsor","Fed Participation","Fed Participation Percent","State Participation","State Participation Percent","Local Participation","Local Participation Percent"]
[null,"Short Description","File_Location","Project Sponsor Name","Population","ProjSponsor Type","Contact Person","Title","Mailing Address","MailCity","MailZip","Phone","Email","Phys_Address","PhysCity","PhysZip","EntityPhone","Website","Partners","ProjectName","ProjectDesc","ProjectCounty","District","MPO?","Which_MPO","SRTS?","Prevapp?","GoogleMapLink","Plan Type","AreaCovered","ExistingATP?","ExistATP_Micro","ExistATP_Ped","ExistATP_Bike","ExistATP_Transit","ExistATP_ADA","Infra#Checks","Partners","ADA Barriers Eliminated","WideRd Barriers Eliminated","Water Barriers Eliminated","Rail Barriers Eliminated","Other Barriers Eliminated","Otherbarriers_text","Timeline_TIPAFA","Timeline_Procurement","Timeline_Other","OtherText","Timeline_PlanDev","Timeline_TotalProject","PlanReview","ExistCon","InfraRecc","VisioningGoalset","PubInvolve","NeedsAsses","DataColl","ProjPrioritization","PolicyRec","ImplementationStr","Other","OtherText","PlanActivitesNo","Itemized Plan Dev Costs","Dir State Costs","Local Match Percent","Txdotmatch","Total Project Cost","TDCs Used?","TDC eligible sponsor","Fed Participation","Fed Participation %","State Participation","State Participation %","Local Participation","Local Participation %"]
[null,"Input Cell Type",null,"Text","Integer","Dropdown","Text","Text","Text","Text","Text","Text","Text","Text","Text","Text","Text","Text","Text","Text","Text","Dropdown","Dropdown","Dropdown","Dropdown","Dropdown","Dropdown","Text","Dropdown","Dropdown","Dropdown","True/False","True/False","True/False","True/False","True/False","Integer","Text","Integer","Integer","Integer","Integer","Integer","Text","Integer","Integer","Integer","Integer","Integer","Integer","True/False","True/False","True/False","True/False","True/False","True/False","True/False","True/False","True/False","True/False","True/False","True/False","Integer","Real number","Real number","Real number","Real number","Real number","True/False","Dropdown","Real number","Real number","Real number","Real number","Real number","Real number"]
[null,"Input",{"$f":"SUBSTITUTE(LEFT(CELL(\"filename\"),FIND(\"]\",CELL(\"filename\"))-1),\"[\",\"\")","v":"https://jacobsengineering-my.sharepoint.com/personal/carl_seifert_jacobs_com/Documents/01_PTN_BikePed/b_Transportation Alternatives Program/2025 Call/Step2/FINAL DAs/Locked Detailed Applications/2025_TA_Planning_DetailedApplication.xlsm"},{"$f":"'Pg1'!D10","v":0},{"$f":"'Pg1'!Q10","v":0},{"$f":"dropdowns!$C$15","v":"(select)"},{"$f":"'Pg1'!I18","v":0},{"$f":"'Pg1'!Q18","v":0},{"$f":"'Pg1'!I20","v":0},{"$f":"'Pg1'!I22","v":0},{"$f":"'Pg1'!I24","v":0},{"$f":"'Pg1'!I26","v":0},{"$f":"'Pg1'!I28","v":0},{"$f":"'Pg1'!Q20","v":0},{"$f":"'Pg1'!Q22","v":0},{"$f":"'Pg1'!Q24","v":0},{"$f":"'Pg1'!Q26","v":0},{"$f":"'Pg1'!Q28","v":0},{"$f":"'Pg1'!N30","v":0},{"$f":"'Pg1'!I34","v":0},{"$f":"'Pg1'!D37","v":0},{"$f":"dropdowns!G260","v":"(select)"},{"$f":"dropdowns!J31","v":"(select)"},{"$f":"dropdowns!C23","v":"(select)"},{"$f":"dropdowns!M29","v":"(select)"},{"$f":"dropdowns!$C$31","v":"(select)"},{"$f":"dropdowns!C39","v":"(select)"},{"$f":"'Pg2'!E6","v":0},{"$f":"dropdowns!C53","v":"(select)"},{"$f":"dropdowns!C63","v":"(select)"},{"$f":"dropdowns!C71","v":"(select)"},{"$f":"dropdowns!B75","v":false},{"$f":"dropdowns!B76","v":false},{"$f":"dropdowns!B77","v":false},{"$f":"dropdowns!B78","v":false},{"$f":"dropdowns!B79","v":false},{"$f":"[1]dropdowns!$B$226","v":false},{"$f":"'Pg2'!E45","v":0},{"$f":"'Pg3'!E16","v":0},{"$f":"'Pg3'!J16","v":0},{"$f":"'Pg3'!O16","v":0},{"$f":"'Pg3'!S16","v":0},{"$f":"'Pg3'!E18","v":0},{"$f":"'Pg3'!I18","v":0},{"$f":"'Pg3'!E36","v":0},{"$f":"'Pg3'!E41","v":0},{"$f":"'Pg3'!E45","v":0},{"$f":"'Pg3'!N45","v":0},{"$f":"'Pg3'!E48","v":0},{"$f":"'Pg3'!E53","v":0},{"$f":"dropdowns!B84","v":false},{"$f":"dropdowns!B85","v":false},{"$f":"dropdowns!B86","v":false},{"$f":"dropdowns!B87","v":false},{"$f":"dropdowns!B88","v":false},{"$f":"dropdowns!B89","v":false},{"$f":"dropdowns!B90","v":false},{"$f":"dropdowns!B91","v":false},{"$f":"dropdowns!B92","v":false},{"$f":"dropdowns!B93","v":false},{"$f":"dropdowns!B94","v":false},{"$f":"Budget1!H18","v":0},{"$f":"dropdowns!B96","v":0},{"$f":"Budget1!Q59","v":0},{"$f":"BudgetSummary!R10","v":0},{"$f":"BudgetSummary!M14","v":0.2},{"$f":"BudgetSummary!M16","v":0},{"$f":"BudgetSummary!R12","v":0},{"$f":"dropdowns!$T$1","v":false},{"$f":"dropdowns!Q118","v":"(select)"},{"$f":"SignaturePage!P5","v":0},{"$f":"SignaturePage!N5","v":0.8},{"$f":"SignaturePage!P7","v":0},{"$f":"SignaturePage!N7","v":0},{"$f":"SignaturePage!P9","v":0},{"$f":"SignaturePage!$N$9","v":0.2}]